{"text_format":"1","workbook":"xlsx","n_sheets":7,"sheets":["Design","Panels","Path","Guides","Layout","Instructions","Bracing"],"not_rendered":{"charts":5,"images":0,"macros":1,"external_links":0,"defined_names":42,"comments":0,"pivot_tables":0},"unopened":[],"bounds":{"document_bytes":16777216,"sheet_cells":100000,"rows_first":2000,"rows_last":500,"rows_between":2000,"halvings":0,"cell_chars":16384,"cell_head_chars":4096},"cells_cut":0,"cells_raw":0,"read":"whole","date_system":"1900"}

{"sheet":"Design","index":0,"n_rows":109,"n_cols":11,"rows_kept":109,"cut":false,"hidden":false,"merged":[[105,3,105,7],[106,3,106,7],[107,3,107,7],[108,3,108,7],[100,3,100,7],[101,3,101,7],[102,3,102,7],[103,3,103,7],[104,3,104,7],[95,3,95,7],[96,3,96,7],[97,3,97,7],[98,3,98,7],[99,3,99,7],[90,3,90,7],[91,3,91,7],[92,3,92,7],[93,3,93,7],[94,3,94,7],[85,3,85,7],[86,3,86,7],[87,3,87,7],[88,3,88,7],[89,3,89,7],[80,3,80,7],[81,3,81,7],[82,3,82,7],[83,3,83,7],[84,3,84,7],[75,3,75,7],[76,3,76,7],[77,3,77,7],[78,3,78,7],[79,3,79,7],[69,3,69,17],[71,3,71,7],[72,3,72,7],[73,3,73,7],[74,3,74,7],[8,8,8,10],[4,8,4,10],[9,8,9,10],[5,8,5,10],[6,8,6,10],[7,8,7,10]]}
[null,"STH Version","=",8.1]
[]
[null,"Driver Dimensions"]
[null,"Frame Width","=",38,"cm",{"$f":"D4/2.54","v":14.960629921259843},"in",null,"Plot"]
[null,"Mounting Width","=",35.799999999999997,"cm",{"$f":"D5/2.54","v":14.094488188976376},"in","x","Panel A, top & bottom"]
[null,"Mounting Depth","=",16.2,"cm",{"$f":"D6/2.54","v":6.3779527559055111},"in","x","Panel B, driver baffle"]
[null,"Magnet Width","=",17,"cm",{"$f":"D7/2.54","v":6.6929133858267713},"in","x","Panel C, sides"]
[null,"Magnet Height","=",6,"cm",{"$f":"D8/2.54","v":2.3622047244094486},"in","x","Panel D, back"]
[null,null,null,null,null,null,null,"x","Panel E, front"]
[null,"Box Dimensions",null,null,null,null,null,"x","Panel F, 1st inside"]
[null,"d (external)","=",{"$f":"24*2.54","v":60.96},"cm",{"$f":"D11/2.54","v":24},"in","x","Panel G, 2nd inside"]
[null,"w (external)","=",{"$f":"18*2.54","v":45.72},"cm",{"$f":"D12/2.54","v":18},"in","x","Panel H, 4th inside"]
[null,"h (external)","=",{"$f":"34*2.54","v":86.36},"cm",{"$f":"D13/2.54","v":34},"in","x","Panel I, 5th inside"]
[]
[null,"driver offset (y)","=",0,"cm",{"$f":"D15/2.54","v":0},"in",null,"Plot"]
{"$rows_left_out":95}
{"sheet":"Panels","index":1,"n_rows":118,"n_cols":27,"rows_kept":118,"cut":false,"hidden":false,"merged":[]}
[]
[]
[]
[null,null,null,null,null,null,null,null,null,null,null,null,null,null,null,null,null,"Exp.","Cos","Sin","Cos","Tan","1/2","Cos","Sin","Cos","Tan"]
[null,null,"x","y",null,"x","y",null,"dx","dy",null,"A","B",null,null,null,1,{"$f":"Design!D43","v":3.5698805012755144},{"$f":"COS(R5*PI()/180)","v":0.99805959852530257},{"$f":"SIN(R5*PI()/180)","v":6.2265863773914992E-2},{"$f":"S5","v":0.99805959852530257},{"$f":"TAN(R5*PI()/180)","v":6.2386919444406747E-2},{"$f":"R5/2","v":1.7849402506377572},{"$f":"COS(W5*PI()/180)","v":0.99951478191302967},{"$f":"SIN(W5*PI()/180)","v":3.1148045481999134E-2},{"$f":"X5","v":0.99951478191302967},{"$f":"TAN(W5*PI()/180)","v":3.1163166413990469E-2}]
[{"$f":"Design!I5","v":"Panel A, top & bottom"},null,{"$f":"C18-Design!D47","v":84.46},{"$f":"D18","v":60.96},null,{"$f":"IF(Design!$H$5=\"x\",C6,0)","v":84.46},{"$f":"IF(Design!$H$5=\"x\",D6,0)","v":60.96},null,null,null,null,null,null,null,null,null,2,{"$f":"Design!$D44","v":23.296245101938531},{"$f":"COS(R6*PI()/180)","v":0.91847230157748139},{"$f":"SIN(R6*PI()/180)","v":0.39548531102300633},{"$f":"S6","v":0.91847230157748139},{"$f":"TAN(R6*PI()/180)","v":0.43059035132987467},{"$f":"R6/2","v":11.648122550969266},{"$f":"COS(W6*PI()/180)","v":0.97940601937538685},{"$f":"SIN(W6*PI()/180)","v":0.20190059239947586},{"$f":"X6","v":0.97940601937538685},{"$f":"TAN(W6*PI()/180)","v":0.2061459582699291}]
[null,null,{"$f":"C6","v":84.46},{"$f":"D20","v":0},null,{"$f":"IF(Design!$H$5=\"x\",C7,0)","v":84.46},{"$f":"IF(Design!$H$5=\"x\",D7,0)","v":0},null,{"$f":"C6-C7","v":0},60.96,{"$f":"(I7^2+J7^2)^0.5","v":60.96},null,null,null,null,null,3,{"$f":"(180-R5)/2-R6","v":64.918814647423716},{"$f":"COS((R7)*PI()/180)","v":0.42390203142045874},{"$f":"SIN((R7)*PI()/180)","v":0.90570804774916758},{"$f":"S7","v":0.42390203142045874},{"$f":"TAN((R7)*PI()/180)","v":2.136597564098051},{"$f":"R7/2","v":32.459407323711858},{"$f":"COS(W7*PI()/180)","v":0.84377189791449525},{"$f":"SIN(W7*PI()/180)","v":0.53670195107691809},{"$f":"X7","v":0.84377189791449525},{"$f":"TAN(W7*PI()/180)","v":0.636074693176503}]
[null,null,{"$f":"C7+Design!D47","v":86.36},{"$f":"D7","v":0},null,{"$f":"IF(Design!$H$5=\"x\",C8,0)","v":86.36},{"$f":"IF(Design!$H$5=\"x\",D8,0)","v":0},null,-1.9000000000000057,0,{"$f":"(I8^2+J8^2)^0.5","v":1.9000000000000057},null,null,null,null,null,"1+2",{"$f":"R5+R6","v":26.866125603214044},{"$f":"COS((R8)*PI()/180)","v":0.89206486206828883},{"$f":"SIN((R8)*PI()/180)","v":0.4519073819524137},{"$f":"S8","v":0.89206486206828883},{"$f":"TAN((R8)*PI()/180)","v":0.5065857889578208},{"$f":"R8/2","v":13.433062801607022},{"$f":"COS(W8*PI()/180)","v":0.97264198502539689},{"$f":"SIN(W8*PI()/180)","v":0.23230920981712189},{"$f":"X8","v":0.97264198502539689},{"$f":"TAN(W8*PI()/180)","v":0.23884349369419416}]
[null,null,{"$f":"C8","v":86.36},{"$f":"D6","v":60.96},null,{"$f":"IF(Design!$H$5=\"x\",C9,0)","v":86.36},{"$f":"IF(Design!$H$5=\"x\",D9,0)","v":60.96},null,0,-60.96,{"$f":"(I9^2+J9^2)^0.5","v":60.96},null,null,null,null,null,"1-2",{"$f":"R5-R6","v":-19.726364600663018},{"$f":"COS((R9)*PI()/180)","v":0.94131533106977472},{"$f":"SIN((R9)*PI()/180)","v":-0.33752843953213851},{"$f":"S9","v":0.94131533106977472},{"$f":"TAN((R9)*PI()/180)","v":-0.35857106369291603},{"$f":"R9/2","v":-9.8631823003315091},{"$f":"COS((R9)*PI()/(180*2))","v":0.98521960269519981},{"$f":"SIN((R9)*PI()/(180*2))","v":-0.17129604334342535},{"$f":"X9","v":0.98521960269519981},{"$f":"TAN((R9)*PI()/(180*2))","v":-0.17386584967942392}]
[null,null,{"$f":"C6","v":84.46},{"$f":"D6","v":60.96},null,{"$f":"IF(Design!$H$5=\"x\",C10,0)","v":84.46},{"$f":"IF(Design!$H$5=\"x\",D10,0)","v":60.96},null,1.9000000000000057,0,{"$f":"(I10^2+J10^2)^0.5","v":1.9000000000000057}]
[]
[{"$f":"Design!I5","v":"Panel A, top & bottom"},null,{"$f":"C19","v":0},{"$f":"D6","v":60.96},null,{"$f":"IF(Design!$H$5=\"x\",C12,0)","v":0},{"$f":"IF(Design!$H$5=\"x\",D12,0)","v":60.96}]
[null,null,{"$f":"C12","v":0},{"$f":"D7","v":0},null,{"$f":"IF(Design!$H$5=\"x\",C13,0)","v":0},{"$f":"IF(Design!$H$5=\"x\",D13,0)","v":0},null,{"$f":"C12-C13","v":0},60.96,{"$f":"(I13^2+J13^2)^0.5","v":60.96}]
[null,null,{"$f":"C13+Design!D47","v":1.9},{"$f":"D13","v":0},null,{"$f":"IF(Design!$H$5=\"x\",C14,0)","v":1.9},{"$f":"IF(Design!$H$5=\"x\",D14,0)","v":0},null,-1.9,0,{"$f":"(I14^2+J14^2)^0.5","v":1.9}]
[null,null,{"$f":"C14","v":1.9},{"$f":"D12","v":60.96},null,{"$f":"IF(Design!$H$5=\"x\",C15,0)","v":1.9},{"$f":"IF(Design!$H$5=\"x\",D15,0)","v":60.96},null,0,-60.96,{"$f":"(I15^2+J15^2)^0.5","v":60.96}]
{"$rows_left_out":104}
{"sheet":"Path","index":2,"n_rows":144,"n_cols":48,"rows_kept":144,"cut":false,"hidden":false,"merged":[[18,24,18,25],[18,27,18,28],[18,30,18,31],[18,18,18,19]]}
[]
[null,null,null,null,null,null,null,"Exp.","Cos","Sin","Cos","Tan","1/2","Cos","Sin","Cos","Tan"]
[null,null,null,null,null,null,1,{"$f":"Design!D43","v":3.5698805012755144},{"$f":"COS(H3*PI()/180)","v":0.99805959852530257},{"$f":"SIN(H3*PI()/180)","v":6.2265863773914992E-2},{"$f":"I3","v":0.99805959852530257},{"$f":"TAN(H3*PI()/180)","v":6.2386919444406747E-2},{"$f":"H3/2","v":1.7849402506377572},{"$f":"COS(M3*PI()/180)","v":0.99951478191302967},{"$f":"SIN(M3*PI()/180)","v":3.1148045481999134E-2},{"$f":"N3","v":0.99951478191302967},{"$f":"TAN(M3*PI()/180)","v":3.1163166413990469E-2}]
[null,null,null,null,null,null,2,{"$f":"Design!$D44","v":23.296245101938531},{"$f":"COS(H4*PI()/180)","v":0.91847230157748139},{"$f":"SIN(H4*PI()/180)","v":0.39548531102300633},{"$f":"I4","v":0.91847230157748139},{"$f":"TAN(H4*PI()/180)","v":0.43059035132987467},{"$f":"H4/2","v":11.648122550969266},{"$f":"COS(M4*PI()/180)","v":0.97940601937538685},{"$f":"SIN(M4*PI()/180)","v":0.20190059239947586},{"$f":"N4","v":0.97940601937538685},{"$f":"TAN(M4*PI()/180)","v":0.2061459582699291}]
[null,null,null,null,null,null,3,{"$f":"(180-H3)/2-H4","v":64.918814647423716},{"$f":"COS((H5)*PI()/180)","v":0.42390203142045874},{"$f":"SIN((H5)*PI()/180)","v":0.90570804774916758},{"$f":"I5","v":0.42390203142045874},{"$f":"TAN((H5)*PI()/180)","v":2.136597564098051},{"$f":"H5/2","v":32.459407323711858},{"$f":"COS(M5*PI()/180)","v":0.84377189791449525},{"$f":"SIN(M5*PI()/180)","v":0.53670195107691809},{"$f":"N5","v":0.84377189791449525},{"$f":"TAN(M5*PI()/180)","v":0.636074693176503}]
[null,null,null,null,null,null,"1+2",{"$f":"H3+H4","v":26.866125603214044},{"$f":"COS((H6)*PI()/180)","v":0.89206486206828883},{"$f":"SIN((H6)*PI()/180)","v":0.4519073819524137},{"$f":"I6","v":0.89206486206828883},{"$f":"TAN((H6)*PI()/180)","v":0.5065857889578208},{"$f":"H6/2","v":13.433062801607022},{"$f":"COS(M6*PI()/180)","v":0.97264198502539689},{"$f":"SIN(M6*PI()/180)","v":0.23230920981712189},{"$f":"N6","v":0.97264198502539689},{"$f":"TAN(M6*PI()/180)","v":0.23884349369419416}]
[null,null,null,null,null,null,"1-2",{"$f":"H3-H4","v":-19.726364600663018},{"$f":"COS((H7)*PI()/180)","v":0.94131533106977472},{"$f":"SIN((H7)*PI()/180)","v":-0.33752843953213851},{"$f":"I7","v":0.94131533106977472},{"$f":"TAN((H7)*PI()/180)","v":-0.35857106369291603},{"$f":"H7/2","v":-9.8631823003315091},{"$f":"COS((H7)*PI()/(180*2))","v":0.98521960269519981},{"$f":"SIN((H7)*PI()/(180*2))","v":-0.17129604334342535},{"$f":"N7","v":0.98521960269519981},{"$f":"TAN((H7)*PI()/(180*2))","v":-0.17386584967942392}]
[]
[null,null,null,null,null,null,null,"S","L","W","d","y",null,null,"Conical",null,null,null,"Exponential"]
[null,null,null,null,null,null,"S1",{"$f":"P24","v":299.99986335379464},{"$f":"O24","v":4.2619480532622975E-2},{"$f":"Design!D12-2*Design!D49","v":43.12},null,{"$f":"H10/J10","v":6.9573252169247368},null,null,{"$f":"(H10/PI())^0.5","v":9.7720480125355067}]
[null,null,null,null,null,null,"S2",{"$f":"P30","v":350.02529454284934},{"$f":"O30","v":18.665291560697856},{"$f":"J10","v":43.12},{"$f":"I11-I10","v":18.622672080165234},8.1174697250196974,{"$f":"ATAN((L11-L10)/(I11-I10))*180/PI()","v":3.5647726710882619},null,{"$f":"(H11/PI())^0.5","v":10.555402013537059},{"$f":"ATAN((O12-O11)/(I12-I11))*180/PI()","v":1.8422846370818815},{"$f":"SIN(P11*PI()/(180*2))","v":1.607627378111965E-2},null,{"$f":"LN(H12/H11)/(I12-I11)","v":4.9099773200771872E-3}]
[null,null,null,null,null,null,"S3",{"$f":"P120","v":807.09732556983454},{"$f":"O120","v":188.81655423250368},{"$f":"J11","v":43.12},{"$f":"I12-I11","v":170.15126267180582},18.717470444569447,{"$f":"ATAN((L12-L11)/(I12-I11))*180/PI()","v":3.5647777957980611},null,16.028320493469547,null,null,null,null,null,null,null,null,null,null,null,null,null,null,null,null,null,null,null,null,null,null,"Intersection points"]
[null,null,null,null,null,null,"S4",{"$f":"P138","v":1592.2102810836757},{"$f":"O138","v":232.99927064421021},{"$f":"J12","v":43.12},{"$f":"I13-I12","v":44.182716411706537},36.9250992830166,null,null,22.512580335279342,null,null,null,null,null,null,null,null,null,null,null,null,null,null,null,null,null,null,null,null,null,null,null,null,null,{"$f":"AO15-AM15","v":14.879251285555199},{"$f":"AP15-AN15","v":-6.4068620385727044}]
[null,null,null,null,null,null,"S5",{"$f":"P144","v":1899.9998790263173},{"$f":"O144","v":250.32098015468324},{"$f":"J13","v":43.12},{"$f":"I14-I13","v":17.321709510473028},44.06307697185337,{"$f":"ATAN((L14-L12)/(I14-I12))*180/PI()","v":22.396266463263128},null,24.592453013924477,null,null,null,null,null,null,null,null,null,null,null,null,null,null,null,null,null,null,null,null,null,null,null,"x1","y1","x2","y2","a","b","x","y","l"]
[null,null,null,null,null,null,null,null,null,null,{"$f":"SUM(K10:K14)","v":250.27836067415063},null,null,null,null,null,null,null,null,null,null,null,null,null,null,null,null,null,null,null,null,null,null,null,null,null,null,"Driver centerline",{"$f":"Panels!S95","v":23.232293680498323},{"$f":"Panels!T95","v":47.323981083166082},{"$f":"Panels!S94","v":38.111544966053522},{"$f":"Panels!T94","v":40.917119044593377},{"$f":"(AP15-AN15)/(AO15-AM15)","v":-0.43059035132987478},{"$f":"(AP15*AM15-AN15*AO15)/(AM15-AO15)","v":57.327582581250695}]
{"$rows_left_out":130}
{"sheet":"Guides","index":3,"n_rows":30,"n_cols":30,"rows_kept":30,"cut":false,"hidden":false,"merged":[]}
["Guides",null,"x","y",null,"x","y"]
[null,null,{"$f":"AB6","v":59.490186664578914},{"$f":"AC6","v":60.960000000000015},null,{"$f":"IF(Design!$H$20=\"x\",C2,0)","v":59.490186664578914},{"$f":"IF(Design!$H$20=\"x\",D2,0)","v":60.960000000000015},null,null,null,null,null,null,null,null,null,null,null,null,null,"Intersection points"]
[null,1,{"$f":"AB7","v":28.608716969710155},{"$f":"AC7","v":0},null,{"$f":"IF(Design!$H$20=\"x\",C3,0)","v":28.608716969710155},{"$f":"IF(Design!$H$20=\"x\",D3,0)","v":0}]
[null,null,null,null,null,null,null,null,null,null,null,null,null,null,null,null,null,null,null,null,null,"x1","y1","x2","y2","a","b","x","y","l"]
[null,null,{"$f":"Panels!C39","v":48.810468593438614},{"$f":"Panels!D39","v":60.96},null,{"$f":"IF(Design!$H$20=\"x\",C5,0)","v":48.810468593438614},{"$f":"IF(Design!$H$20=\"x\",D5,0)","v":60.96},null,null,null,null,null,null,null,null,null,null,null,null,null,"Front",{"$f":"Panels!C19","v":0},{"$f":"Panels!D19","v":60.96},{"$f":"Panels!C18","v":86.36},{"$f":"Panels!D18","v":60.96},{"$f":"(Y5-W5)/(X5-V5)","v":0},{"$f":"(Y5*V5-W5*X5)/(V5-X5)","v":60.960000000000008}]
[null,2,{"$f":"(D6-Panels!D38)*(Panels!C39-Panels!C38)/(Panels!D39-Panels!D38)+Panels!C38","v":22.56168077636945},{"$f":"Panels!D20","v":0},null,{"$f":"IF(Design!$H$20=\"x\",C6,0)","v":22.56168077636945},{"$f":"IF(Design!$H$20=\"x\",D6,0)","v":0},null,null,null,null,null,null,null,null,null,null,null,null,null,"Panel G1",{"$f":"Panels!C51","v":39.667347313556128},{"$f":"Panels!D51","v":21.829728715044407},{"$f":"Panels!C50","v":53.747956426901077},{"$f":"Panels!D50","v":49.624841448689061},{"$f":"(Y6-W6)/(X6-V6)","v":1.973999314227233},{"$f":"(Y6*V6-W6*X6)/(V6-X6)","v":-56.473587679128848},{"$f":"(AA5-AA6)/(Z6-Z5)","v":59.490186664578914},{"$f":"AB6*Z6+AA6","v":60.960000000000015},{"$f":"(AB6^2+AC6^2)^0.5","v":85.177484756163381}]
[null,null,null,null,null,null,null,null,null,null,null,null,null,null,null,null,null,null,null,null,"Back",{"$f":"Panels!C20","v":0},{"$f":"Panels!D20","v":0},{"$f":"Panels!C21","v":86.36},{"$f":"Panels!D21","v":0},{"$f":"(Y7-W7)/(X7-V7)","v":0},{"$f":"(Y7*V7-W7*X7)/(V7-X7)","v":0},{"$f":"(AA6-AA7)/(Z7-Z6)","v":28.608716969710155},{"$f":"AB7*Z7+AA7","v":0},{"$f":"(AB7^2+AC7^2)^0.5","v":28.608716969710155}]
[null,null,{"$f":"AB14","v":75.203512267863985},{"$f":"AC14","v":60.960000000000036},null,{"$f":"IF(Design!$H$20=\"x\",C8,0)","v":75.203512267863985},{"$f":"IF(Design!$H$20=\"x\",D8,0)","v":60.960000000000036}]
[null,3,{"$f":"AB15","v":66.412859932827686},{"$f":"AC15","v":0},null,{"$f":"IF(Design!$H$20=\"x\",C9,0)","v":66.412859932827686},{"$f":"IF(Design!$H$20=\"x\",D9,0)","v":0},null,null,null,null,null,null,null,null,null,null,null,null,null,"Front",{"$f":"V5","v":0},{"$f":"W5","v":60.96},{"$f":"X5","v":86.36},{"$f":"Y5","v":60.96},{"$f":"(Y9-W9)/(X9-V9)","v":0},{"$f":"(Y9*V9-W9*X9)/(V9-X9)","v":60.960000000000008}]
[null,null,null,null,null,null,null,null,null,null,null,null,null,null,null,null,null,null,null,null,"Panel G1",{"$f":"V6","v":39.667347313556128},{"$f":"W6","v":21.829728715044407},{"$f":"X6","v":53.747956426901077},{"$f":"Y6","v":49.624841448689061},{"$f":"(Y10-W10)/(X10-V10)","v":1.973999314227233},{"$f":"(Y10*V10-W10*X10)/(V10-X10)","v":-56.473587679128848},{"$f":"(AA9-AA10)/(Z10-Z9)","v":59.490186664578914},{"$f":"AB10*Z10+AA10","v":60.960000000000015},{"$f":"(AB10^2+AC10^2)^0.5","v":85.177484756163381}]
[null,null,{"$f":"Panels!C20","v":0},{"$f":"Panels!D20","v":0},null,{"$f":"IF(Design!$H$20=\"x\",C11,0)","v":0},{"$f":"IF(Design!$H$20=\"x\",D11,0)","v":0},null,null,null,null,null,null,null,null,null,null,null,null,null,"Back",{"$f":"V7","v":0},{"$f":"W7","v":0},{"$f":"X7","v":86.36},{"$f":"Y7","v":0},{"$f":"(Y11-W11)/(X11-V11)","v":0},{"$f":"(Y11*V11-W11*X11)/(V11-X11)","v":0},{"$f":"(AA10-AA11)/(Z11-Z10)","v":28.608716969710155},{"$f":"AB11*Z11+AA11","v":0},{"$f":"(AB11^2+AC11^2)^0.5","v":28.608716969710155}]
[null,4,{"$f":"Panels!C19","v":0},{"$f":"Panels!D19","v":60.96},null,{"$f":"IF(Design!$H$20=\"x\",C12,0)","v":0},{"$f":"IF(Design!$H$20=\"x\",D12,0)","v":60.96}]
[null,null,null,null,null,null,null,null,null,null,null,null,null,null,null,null,null,null,null,null,"Front",{"$f":"V9","v":0},{"$f":"W9","v":60.96},{"$f":"X9","v":86.36},{"$f":"Y9","v":60.96},{"$f":"(Y13-W13)/(X13-V13)","v":0},{"$f":"(Y13*V13-W13*X13)/(V13-X13)","v":60.960000000000008}]
[null,null,{"$f":"Panels!C20","v":0},{"$f":"(C14-Panels!C43)*(Panels!D44-Panels!D43)/(Panels!C44-Panels!C43)+Panels!D43","v":22.479174552513385},null,{"$f":"IF(Design!$H$20=\"x\",C14,0)","v":0},{"$f":"IF(Design!$H$20=\"x\",D14,0)","v":22.479174552513385},null,null,null,null,null,null,null,null,null,null,null,null,null,"Edges",{"$f":"Panels!C44","v":69.033384878043279},{"$f":"Panels!D44","v":18.172394331152169},{"$f":"Panels!C56","v":73.21639900628665},{"$f":"Panels!D56","v":47.180086995938112},{"$f":"(Y14-W14)/(X14-V14)","v":6.9346389410756126},{"$f":"(Y14*V14-W14*X14)/(V14-X14)","v":-460.54920467838713},{"$f":"(AA13-AA14)/(Z14-Z13)","v":75.203512267863985},{"$f":"AB14*Z14+AA14","v":60.960000000000036},{"$f":"(AB14^2+AC14^2)^0.5","v":96.807488643300587}]
[null,5,{"$f":"Panels!C21","v":86.36},{"$f":"(C15-Panels!C43)*(Panels!D44-Panels!D43)/(Panels!C44-Panels!C43)+Panels!D43","v":17.091440189294417},null,{"$f":"IF(Design!$H$20=\"x\",C15,0)","v":86.36},{"$f":"IF(Design!$H$20=\"x\",D15,0)","v":17.091440189294417},null,null,null,null,null,null,null,null,null,null,null,null,null,"Back",{"$f":"V11","v":0},{"$f":"W11","v":0},{"$f":"X11","v":86.36},{"$f":"Y11","v":0},{"$f":"(Y15-W15)/(X15-V15)","v":0},{"$f":"(Y15*V15-W15*X15)/(V15-X15)","v":0},{"$f":"(AA14-AA15)/(Z15-Z14)","v":66.412859932827686},{"$f":"AB15*Z15+AA15","v":0},{"$f":"(AB15^2+AC15^2)^0.5","v":66.412859932827686}]
{"$rows_left_out":16}
{"sheet":"Layout","index":4,"n_rows":0,"n_cols":0,"rows_kept":0,"cut":false,"hidden":false,"merged":[]}

{"sheet":"Instructions","index":5,"n_rows":12,"n_cols":3,"rows_kept":12,"cut":false,"hidden":false,"merged":[]}
[]
[null,"Instructions"]
[]
[null,1,{"$f":"CONCATENATE(\"Cut out the side panels, \",Design!$E$49,\"cm x \",Design!$F$49,\"cm (2 are required)\")","v":"Cut out the side panels, 86.4cm x 61cm (2 are required)"}]
[null,{"$f":"B4+1","v":2},"Draw out the guides on the side panels as illustrated. One panel must mirror the other"]
[null,3,{"$f":"CONCATENATE(\"Prepare the speaker baffle.  This panel should be \",ROUND(Design!$E$48,1),\"cm x \",ROUND(Design!$F$48,1),\" cm. Cut the mounting hole for the speaker so that it is \",Design!D16,\" cm from one of the ends that measures \",Design!E47,\" cm.\")","v":"Prepare the speaker baffle.  This panel should be 43.1cm x 42.6 cm. Cut the mounting hole for the speaker so that it is 20 cm from one of the ends that measures 43.1 cm."}]
[null,4,"Using the guides on the side panel, join the speaker baffle and all of the internal panels to the side panel."]
[null,5,"Cut out and join all the rest of the bracing panels to the internal panels."]
[null,6,{"$f":"CONCATENATE(\"Cut out the front panel (\",ROUND(Design!E51,1),\"cm x \",ROUND(Design!F51,1),\"cm), top and bottom panels (\",ROUND(Design!E47,1),\"cm x \",ROUND(Design!F47,1),\"cm), and back panel (\",ROUND(Design!E50,1),\"cm x \",ROUND(Design!F50,1),\"cm)\")","v":"Cut out the front panel (43.1cm x 35.6cm), top and bottom panels (43.1cm x 61cm), and back panel (43.1cm x 82.6cm)"}]
[null,7,"Join the front panel, top and bottom panels and back panels to the side panel to which the other panels have already been joined.  "]
[null,8,"Double-check to ensure that all joins are airtight. "]
[null,9,"Finally, join the remaining side panel to the rest of the box.  This should complete the build. Again, ensure that all joins are airtight."]

{"sheet":"Bracing","index":6,"n_rows":21,"n_cols":28,"rows_kept":21,"cut":false,"hidden":false,"merged":[]}
["Bracing",null,"x","y",null,"x","y",null,null,null,null,null,null,null,null,null,null,null,"Intersection points"]
[null,null,{"$f":"Z5","v":71.318671730995916},{"$f":"AA5","v":34.020033533165666},null,{"$f":"IF(Design!$H$19=\"x\",C2,0)","v":0},{"$f":"IF(Design!$H$19=\"x\",D2,0)","v":0}]
[null,1,{"$f":"Panels!C60","v":84.46},{"$f":"Panels!D60","v":34.020033533165666},null,{"$f":"IF(Design!$H$19=\"x\",C3,0)","v":0},{"$f":"IF(Design!$H$19=\"x\",D3,0)","v":0},null,null,null,null,null,null,null,null,null,null,null,null,"x1","y1","x2","y2","a","b","x","y","l"]
[null,null,{"$f":"Panels!C25","v":84.46},{"$f":"Panels!D25","v":1.9},null,{"$f":"IF(Design!$H$19=\"x\",C4,0)","v":0},{"$f":"IF(Design!$H$19=\"x\",D4,0)","v":0},null,null,null,null,null,null,null,null,null,null,null,"Guide 1",{"$f":"Guides!C9","v":66.412859932827686},{"$f":"Guides!D9","v":0},{"$f":"Guides!C8","v":75.203512267863985},{"$f":"Guides!D8","v":60.960000000000036},{"$f":"(W4-U4)/(V4-T4)","v":6.9346389410756188},{"$f":"(W4*T4-U4*V4)/(T4-V4)","v":-460.54920467838758}]
[null,null,{"$f":"Panels!C24","v":1.9},{"$f":"Panels!D24","v":1.9},null,{"$f":"IF(Design!$H$19=\"x\",C5,0)","v":0},{"$f":"IF(Design!$H$19=\"x\",D5,0)","v":0},null,null,null,null,null,null,null,null,null,null,null,"Guide 2",{"$f":"Guides!C23","v":0},{"$f":"Guides!D23","v":34.020033533165666},{"$f":"Guides!C24","v":86.36},{"$f":"Guides!D24","v":34.020033533165666},{"$f":"(W5-U5)/(V5-T5)","v":0},{"$f":"(W5*T5-U5*V5)/(T5-V5)","v":34.020033533165666},{"$f":"(Y4-Y5)/(X5-X4)","v":71.318671730995916},{"$f":"Z5*X5+Y5","v":34.020033533165666},{"$f":"(Z5^2+AA5^2)^0.5","v":79.017185593206705}]
[null,null,{"$f":"C5","v":1.9},{"$f":"(Guides!D20+Guides!D14)/2","v":37.76476728070238},null,{"$f":"IF(Design!$H$19=\"x\",C6,0)","v":0},{"$f":"IF(Design!$H$19=\"x\",D6,0)","v":0}]
[null,null,{"$f":"Z8","v":29.383021814377031},{"$f":"AA8","v":20.646058337546592},null,{"$f":"IF(Design!$H$19=\"x\",C7,0)","v":0},{"$f":"IF(Design!$H$19=\"x\",D7,0)","v":0},null,null,null,null,null,null,null,null,null,null,null,"Guide 3",{"$f":"Guides!C14","v":0},{"$f":"Guides!D14","v":22.479174552513385},{"$f":"Guides!C15","v":86.36},{"$f":"Guides!D15","v":17.091440189294417},{"$f":"(W7-U7)/(V7-T7)","v":-6.238691944440676E-2},{"$f":"(W7*T7-U7*V7)/(T7-V7)","v":22.479174552513385}]
[null,null,{"$f":"Panels!C44","v":69.033384878043279},{"$f":"Panels!D44","v":18.172394331152169},null,{"$f":"IF(Design!$H$19=\"x\",C8,0)","v":0},{"$f":"IF(Design!$H$19=\"x\",D8,0)","v":0},null,null,null,null,null,null,null,null,null,null,null,"Panel B",{"$f":"Panels!C36","v":47.065371220441399},{"$f":"Panels!D36","v":61.711422090943714},{"$f":"Panels!C37","v":30.201838745593395},{"$f":"Panels!D37","v":22.547673013043749},{"$f":"(W8-U8)/(V8-T8)","v":2.3223929586705978},{"$f":"(W8*T8-U8*V8)/(T8-V8)","v":-47.592864628627197},{"$f":"(Y7-Y8)/(X8-X7)","v":29.383021814377031},{"$f":"Z8*X8+Y8","v":20.646058337546592},{"$f":"(Z8^2+AA8^2)^0.5","v":35.911303176319478}]
[null,null,{"$f":"C2","v":71.318671730995916},{"$f":"D2","v":34.020033533165666},null,{"$f":"IF(Design!$H$19=\"x\",C9,0)","v":0},{"$f":"IF(Design!$H$19=\"x\",D9,0)","v":0}]
[null,null,null,null,null,null,null,null,null,null,null,null,null,null,null,null,null,null,"Guide 3",{"$f":"Guides!C8","v":75.203512267863985},{"$f":"Guides!D8","v":60.960000000000036},{"$f":"Guides!C9","v":66.412859932827686},{"$f":"Guides!D9","v":0},{"$f":"(W10-U10)/(V10-T10)","v":6.9346389410756188},{"$f":"(W10*T10-U10*V10)/(T10-V10)","v":-460.54920467838758}]
[null,null,{"$f":"Panels!C32","v":48.810468593438614},{"$f":"Panels!D32","v":59.06},null,{"$f":"IF(Design!$H$19=\"x\",C11,0)","v":0},{"$f":"IF(Design!$H$19=\"x\",D11,0)","v":0},null,null,null,null,null,null,null,null,null,null,null,"Panel I",{"$f":"Panels!C62","v":62.219243022578823},{"$f":"Panels!D62","v":35.320033533165663},{"$f":"Panels!C63","v":84.46},{"$f":"Panels!D63","v":35.320033533165663},{"$f":"(W11-U11)/(V11-T11)","v":0},{"$f":"(W11*T11-U11*V11)/(T11-V11)","v":35.320033533165656},{"$f":"(Y10-Y11)/(X11-X10)","v":71.506136429741773},{"$f":"Z11*X11+Y11","v":35.320033533165656},{"$f":"(Z11^2+AA11^2)^0.5","v":79.753572433420118}]
[null,2,{"$f":"Panels!C54","v":54.907640747589852},{"$f":"Panels!D54","v":49.624841448689061},null,{"$f":"IF(Design!$H$19=\"x\",C12,0)","v":0},{"$f":"IF(Design!$H$19=\"x\",D12,0)","v":0}]
[null,null,{"$f":"Panels!C55","v":73.297344629192736},{"$f":"Panels!D55","v":48.477564474021008},null,{"$f":"IF(Design!$H$19=\"x\",C13,0)","v":0},{"$f":"IF(Design!$H$19=\"x\",D13,0)","v":0}]
[null,null,{"$f":"Z11","v":71.506136429741773},{"$f":"AA11","v":35.320033533165656},null,{"$f":"IF(Design!$H$19=\"x\",C14,0)","v":0},{"$f":"IF(Design!$H$19=\"x\",D14,0)","v":0}]
[null,null,{"$f":"Panels!C63","v":84.46},{"$f":"Panels!D63","v":35.320033533165663},null,{"$f":"IF(Design!$H$19=\"x\",C15,0)","v":0},{"$f":"IF(Design!$H$19=\"x\",D15,0)","v":0}]
{"$rows_left_out":6}