{"text_format":"1","workbook":"xlsx","n_sheets":7,"sheets":["Design","Panels","Path","Guides","Layout","Instructions","Bracing"],"not_rendered":{"charts":5,"images":0,"macros":1,"external_links":0,"defined_names":50,"comments":0,"pivot_tables":0},"unopened":[],"bounds":{"document_bytes":16777216,"sheet_cells":100000,"rows_first":2000,"rows_last":500,"rows_between":2000,"halvings":0,"cell_chars":16384,"cell_head_chars":4096},"cells_cut":0,"cells_raw":0,"read":"whole","date_system":"1900"}

{"sheet":"Design","index":0,"n_rows":113,"n_cols":10,"rows_kept":113,"cut":false,"hidden":false,"merged":[[8,8,8,10],[4,8,4,10],[9,8,9,10],[5,8,5,10],[6,8,6,10],[7,8,7,10],[73,3,73,17],[75,3,75,7],[76,3,76,7],[77,3,77,7],[78,3,78,7],[79,3,79,7],[80,3,80,7],[81,3,81,7],[82,3,82,7],[83,3,83,7],[84,3,84,7],[85,3,85,7],[86,3,86,7],[87,3,87,7],[88,3,88,7],[89,3,89,7],[90,3,90,7],[91,3,91,7],[92,3,92,7],[93,3,93,7],[94,3,94,7],[95,3,95,7],[96,3,96,7],[97,3,97,7],[98,3,98,7],[99,3,99,7],[100,3,100,7],[101,3,101,7],[102,3,102,7],[103,3,103,7],[109,3,109,7],[110,3,110,7],[111,3,111,7],[112,3,112,7],[104,3,104,7],[105,3,105,7],[106,3,106,7],[107,3,107,7],[108,3,108,7]]}
[null,"MWTH Version","=","0.3 BETA"]
[]
[null,"Driver Dimensions"]
[null,"Frame Width","=",38,"cm",{"$f":"D4/2.54","v":14.960629921259843},"in",null,"Plot"]
[null,"Mounting Width","=",35.799999999999997,"cm",{"$f":"D5/2.54","v":14.094488188976376},"in","x","Panel A, top & bottom"]
[null,"Mounting Depth","=",16.2,"cm",{"$f":"D6/2.54","v":6.3779527559055111},"in","x","Panel B, driver baffle"]
[null,"Magnet Width","=",17,"cm",{"$f":"D7/2.54","v":6.6929133858267713},"in","x","Panel C, sides"]
[null,"Magnet Height","=",6,"cm",{"$f":"D8/2.54","v":2.3622047244094486},"in","x","Panel D, back"]
[null,null,null,null,null,null,null,"x","Panel E, front"]
[null,"Box Dimensions",null,null,null,null,null,"x","Panel F, 1st inside"]
{"$rows_left_out":104}
{"sheet":"Panels","index":1,"n_rows":118,"n_cols":27,"rows_kept":118,"cut":false,"hidden":false,"merged":[]}
[]
[]
[]
[null,null,null,null,null,null,null,null,null,null,null,null,null,null,null,null,null,"Exp.","Cos","Sin","Cos","Tan","1/2","Cos","Sin","Cos","Tan"]
[null,null,"x","y",null,"x","y",null,"dx","dy",null,"A","B",null,null,null,1,{"$f":"Design!D45","v":2.7229640864390294},{"$f":"COS(R5*PI()/180)","v":0.99887091451727661},{"$f":"SIN(R5*PI()/180)","v":4.7506800896498627E-2},{"$f":"S5","v":0.99887091451727661},{"$f":"TAN(R5*PI()/180)","v":4.7560500767466228E-2},{"$f":"R5/2","v":1.3614820432195147},{"$f":"COS(W5*PI()/180)","v":0.99971768877950651},{"$f":"SIN(W5*PI()/180)","v":2.3760108193392446E-2},{"$f":"X5","v":0.99971768877950651},{"$f":"TAN(W5*PI()/180)","v":2.3766817832742055E-2}]
[{"$f":"Design!I5","v":"Panel A, top & bottom"},null,{"$f":"C18-Design!D49","v":118.75},{"$f":"D18","v":76.835000000000008},null,{"$f":"IF(Design!$H$5=\"x\",C6,0)","v":118.75},{"$f":"IF(Design!$H$5=\"x\",D6,0)","v":76.835000000000008},null,null,null,null,null,null,null,null,null,2,{"$f":"Design!$D46","v":4.6422128437590908},{"$f":"COS(R6*PI()/180)","v":0.99671952112631668},{"$f":"SIN(R6*PI()/180)","v":8.0933282435138282E-2},{"$f":"S6","v":0.99671952112631668},{"$f":"TAN(R6*PI()/180)","v":8.1199656191825911E-2},{"$f":"R6/2","v":2.3211064218795454},{"$f":"COS(W6*PI()/180)","v":0.9991795437073151},{"$f":"SIN(W6*PI()/180)","v":4.049986959042752E-2},{"$f":"X6","v":0.9991795437073151},{"$f":"TAN(W6*PI()/180)","v":4.0533125248099509E-2}]
[null,null,{"$f":"C6","v":118.75},{"$f":"D20","v":0},null,{"$f":"IF(Design!$H$5=\"x\",C7,0)","v":118.75},{"$f":"IF(Design!$H$5=\"x\",D7,0)","v":0},null,{"$f":"C6-C7","v":0},76.835000000000008,{"$f":"(I7^2+J7^2)^0.5","v":76.835000000000008},null,null,null,null,null,3,{"$f":"(180-R5)/2-R6","v":83.996305113021393},{"$f":"COS((R7)*PI()/180)","v":0.10459259772182318},{"$f":"SIN((R7)*PI()/180)","v":0.99451515247471256},{"$f":"S7","v":0.10459259772182318},{"$f":"TAN((R7)*PI()/180)","v":9.5084659348431853},{"$f":"R7/2","v":41.998152556510696},{"$f":"COS(W7*PI()/180)","v":0.74316640051936655},{"$f":"SIN(W7*PI()/180)","v":0.66910664407035181},{"$f":"X7","v":0.74316640051936655},{"$f":"TAN(W7*PI()/180)","v":0.90034566094853363}]
[null,null,{"$f":"C7+Design!D49","v":120.65},{"$f":"D7","v":0},null,{"$f":"IF(Design!$H$5=\"x\",C8,0)","v":120.65},{"$f":"IF(Design!$H$5=\"x\",D8,0)","v":0},null,-1.9000000000000057,0,{"$f":"(I8^2+J8^2)^0.5","v":1.9000000000000057},null,null,null,null,null,"1+2",{"$f":"R5+R6","v":7.3651769301981203},{"$f":"COS((R8)*PI()/180)","v":0.99174925825011973},{"$f":"SIN((R8)*PI()/180)","v":0.12819285768067298},{"$f":"S8","v":0.99174925825011973},{"$f":"TAN((R8)*PI()/180)","v":0.12925934313967763},{"$f":"R8/2","v":3.6825884650990601},{"$f":"COS(W8*PI()/180)","v":0.99793518282755211},{"$f":"SIN(W8*PI()/180)","v":6.4229050085923931E-2},{"$f":"X8","v":0.99793518282755211},{"$f":"TAN(W8*PI()/180)","v":6.4361945736733289E-2}]
[null,null,{"$f":"C8","v":120.65},{"$f":"D6","v":76.835000000000008},null,{"$f":"IF(Design!$H$5=\"x\",C9,0)","v":120.65},{"$f":"IF(Design!$H$5=\"x\",D9,0)","v":76.835000000000008},null,0,-76.835000000000008,{"$f":"(I9^2+J9^2)^0.5","v":76.835000000000008},null,null,null,null,null,"1-2",{"$f":"R5-R6","v":-1.9192487573200614},{"$f":"COS((R9)*PI()/180)","v":0.99943902091921211},{"$f":"SIN((R9)*PI()/180)","v":-3.3490946001070228E-2},{"$f":"S9","v":0.99943902091921211},{"$f":"TAN((R9)*PI()/180)","v":-3.3509744266606342E-2},{"$f":"R9/2","v":-0.9596243786600307},{"$f":"COS((R9)*PI()/(180*2))","v":0.99985974539412581},{"$f":"SIN((R9)*PI()/(180*2))","v":-1.6747821959703323E-2},{"$f":"X9","v":0.99985974539412581},{"$f":"TAN((R9)*PI()/(180*2))","v":-1.675017124837009E-2}]
[null,null,{"$f":"C6","v":118.75},{"$f":"D6","v":76.835000000000008},null,{"$f":"IF(Design!$H$5=\"x\",C10,0)","v":118.75},{"$f":"IF(Design!$H$5=\"x\",D10,0)","v":76.835000000000008},null,1.9000000000000057,0,{"$f":"(I10^2+J10^2)^0.5","v":1.9000000000000057}]
{"$rows_left_out":109}
{"sheet":"Path","index":2,"n_rows":165,"n_cols":48,"rows_kept":165,"cut":false,"hidden":false,"merged":[[18,24,18,25],[18,27,18,28],[18,30,18,31],[18,18,18,19]]}
[]
[null,null,null,null,null,null,null,"Exp.","Cos","Sin","Cos","Tan","1/2","Cos","Sin","Cos","Tan"]
[null,null,null,null,null,null,1,{"$f":"Design!D45","v":2.7229640864390294},{"$f":"COS(H3*PI()/180)","v":0.99887091451727661},{"$f":"SIN(H3*PI()/180)","v":4.7506800896498627E-2},{"$f":"I3","v":0.99887091451727661},{"$f":"TAN(H3*PI()/180)","v":4.7560500767466228E-2},{"$f":"H3/2","v":1.3614820432195147},{"$f":"COS(M3*PI()/180)","v":0.99971768877950651},{"$f":"SIN(M3*PI()/180)","v":2.3760108193392446E-2},{"$f":"N3","v":0.99971768877950651},{"$f":"TAN(M3*PI()/180)","v":2.3766817832742055E-2}]
[null,null,null,null,null,null,2,{"$f":"Design!$D46","v":4.6422128437590908},{"$f":"COS(H4*PI()/180)","v":0.99671952112631668},{"$f":"SIN(H4*PI()/180)","v":8.0933282435138282E-2},{"$f":"I4","v":0.99671952112631668},{"$f":"TAN(H4*PI()/180)","v":8.1199656191825911E-2},{"$f":"H4/2","v":2.3211064218795454},{"$f":"COS(M4*PI()/180)","v":0.9991795437073151},{"$f":"SIN(M4*PI()/180)","v":4.049986959042752E-2},{"$f":"N4","v":0.9991795437073151},{"$f":"TAN(M4*PI()/180)","v":4.0533125248099509E-2}]
[null,null,null,null,null,null,3,{"$f":"(180-H3)/2-H4","v":83.996305113021393},{"$f":"COS((H5)*PI()/180)","v":0.10459259772182318},{"$f":"SIN((H5)*PI()/180)","v":0.99451515247471256},{"$f":"I5","v":0.10459259772182318},{"$f":"TAN((H5)*PI()/180)","v":9.5084659348431853},{"$f":"H5/2","v":41.998152556510696},{"$f":"COS(M5*PI()/180)","v":0.74316640051936655},{"$f":"SIN(M5*PI()/180)","v":0.66910664407035181},{"$f":"N5","v":0.74316640051936655},{"$f":"TAN(M5*PI()/180)","v":0.90034566094853363}]
[null,null,null,null,null,null,"1+2",{"$f":"H3+H4","v":7.3651769301981203},{"$f":"COS((H6)*PI()/180)","v":0.99174925825011973},{"$f":"SIN((H6)*PI()/180)","v":0.12819285768067298},{"$f":"I6","v":0.99174925825011973},{"$f":"TAN((H6)*PI()/180)","v":0.12925934313967763},{"$f":"H6/2","v":3.6825884650990601},{"$f":"COS(M6*PI()/180)","v":0.99793518282755211},{"$f":"SIN(M6*PI()/180)","v":6.4229050085923931E-2},{"$f":"N6","v":0.99793518282755211},{"$f":"TAN(M6*PI()/180)","v":6.4361945736733289E-2}]
[null,null,null,null,null,null,"1-2",{"$f":"H3-H4","v":-1.9192487573200614},{"$f":"COS((H7)*PI()/180)","v":0.99943902091921211},{"$f":"SIN((H7)*PI()/180)","v":-3.3490946001070228E-2},{"$f":"I7","v":0.99943902091921211},{"$f":"TAN((H7)*PI()/180)","v":-3.3509744266606342E-2},{"$f":"H7/2","v":-0.9596243786600307},{"$f":"COS((H7)*PI()/(180*2))","v":0.99985974539412581},{"$f":"SIN((H7)*PI()/(180*2))","v":-1.6747821959703323E-2},{"$f":"N7","v":0.99985974539412581},{"$f":"TAN((H7)*PI()/(180*2))","v":-1.675017124837009E-2}]
[]
[null,null,null,null,null,null,null,"S","L","W","d","y",null,null,"Conical",null,null,null,"Exponential"]
[null,null,null,null,null,null,"S1",{"$f":"P24","v":254.00078374287892},{"$f":"O24","v":1.2541546914346694E-3},{"$f":"Design!D12-2*Design!D51","v":57.160000000000004},null,{"$f":"H10/J10","v":4.443680611316986},null,null,{"$f":"(H10/PI())^0.5","v":8.9917162190423596}]
{"$rows_left_out":156}
{"sheet":"Guides","index":3,"n_rows":30,"n_cols":30,"rows_kept":30,"cut":false,"hidden":false,"merged":[]}
["Guides",null,"x","y",null,"x","y"]
[null,null,{"$f":"AB6","v":42.295426384251904},{"$f":"AC6","v":76.83499999999998},null,{"$f":"IF(Design!$H$22=\"x\",C2,0)","v":0},{"$f":"IF(Design!$H$22=\"x\",D2,0)","v":0},null,null,null,null,null,null,null,null,null,null,null,null,null,"Intersection points"]
[null,1,{"$f":"AB7","v":32.363784754114775},{"$f":"AC7","v":0},null,{"$f":"IF(Design!$H$22=\"x\",C3,0)","v":0},{"$f":"IF(Design!$H$22=\"x\",D3,0)","v":0}]
[null,null,null,null,null,null,null,null,null,null,null,null,null,null,null,null,null,null,null,null,null,"x1","y1","x2","y2","a","b","x","y","l"]
[null,null,{"$f":"Panels!C39","v":35.548065717529553},{"$f":"Panels!D39","v":76.835000000000008},null,{"$f":"IF(Design!$H$22=\"x\",C5,0)","v":0},{"$f":"IF(Design!$H$22=\"x\",D5,0)","v":0},null,null,null,null,null,null,null,null,null,null,null,null,null,"Front",{"$f":"Panels!C19","v":0},{"$f":"Panels!D19","v":76.835000000000008},{"$f":"Panels!C18","v":120.65},{"$f":"Panels!D18","v":76.835000000000008},{"$f":"(Y5-W5)/(X5-V5)","v":0},{"$f":"(Y5*V5-W5*X5)/(V5-X5)","v":76.835000000000008}]
[null,2,{"$f":"(D6-Panels!D38)*(Panels!C39-Panels!C38)/(Panels!D39-Panels!D38)+Panels!C38","v":29.309090134030612},{"$f":"Panels!D20","v":0},null,{"$f":"IF(Design!$H$22=\"x\",C6,0)","v":0},{"$f":"IF(Design!$H$22=\"x\",D6,0)","v":0},null,null,null,null,null,null,null,null,null,null,null,null,null,"Panel",{"$f":"Panels!C51","v":36.145462410396654},{"$f":"Panels!D51","v":29.256513025873851},{"$f":"Panels!C50","v":41.190161894408035},{"$f":"Panels!D50","v":68.284248750633637},{"$f":"(Y6-W6)/(X6-V6)","v":7.7363846644292469},{"$f":"(Y6*V6-W6*X6)/(V6-X6)","v":-250.37868805462261},{"$f":"(AA5-AA6)/(Z6-Z5)","v":42.295426384251904},{"$f":"AB6*Z6+AA6","v":76.83499999999998},{"$f":"(AB6^2+AC6^2)^0.5","v":87.707014075418556}]
[null,null,null,null,null,null,null,null,null,null,null,null,null,null,null,null,null,null,null,null,"Back",{"$f":"Panels!C20","v":0},{"$f":"Panels!D20","v":0},{"$f":"Panels!C21","v":120.65},{"$f":"Panels!D21","v":0},{"$f":"(Y7-W7)/(X7-V7)","v":0},{"$f":"(Y7*V7-W7*X7)/(V7-X7)","v":0},{"$f":"(AA6-AA7)/(Z7-Z6)","v":32.363784754114775},{"$f":"AB7*Z7+AA7","v":0},{"$f":"(AB7^2+AC7^2)^0.5","v":32.363784754114775}]
[null,null,{"$f":"AB14","v":109.13472187516774},{"$f":"AC14","v":76.835000000000036},null,{"$f":"IF(Design!$H$22=\"x\",C8,0)","v":0},{"$f":"IF(Design!$H$22=\"x\",D8,0)","v":0}]
[null,3,{"$f":"AB15","v":105.48041079869948},{"$f":"AC15","v":0},null,{"$f":"IF(Design!$H$22=\"x\",C9,0)","v":0},{"$f":"IF(Design!$H$22=\"x\",D9,0)","v":0},null,null,null,null,null,null,null,null,null,null,null,null,null,"Front",{"$f":"V5","v":0},76.835000000000008,120.65,76.835000000000008,{"$f":"(Y9-W9)/(X9-V9)","v":0},{"$f":"(Y9*V9-W9*X9)/(V9-X9)","v":76.835000000000008}]
[null,null,null,null,null,null,null,null,null,null,null,null,null,null,null,null,null,null,null,null,"Panel",36.145462410396654,29.256513025873851,41.190161894408035,68.284248750633637,{"$f":"(Y10-W10)/(X10-V10)","v":7.7363846644292469},{"$f":"(Y10*V10-W10*X10)/(V10-X10)","v":-250.37868805462261},{"$f":"(AA9-AA10)/(Z10-Z9)","v":42.295426384251904},{"$f":"AB10*Z10+AA10","v":76.83499999999998},{"$f":"(AB10^2+AC10^2)^0.5","v":87.707014075418556}]
{"$rows_left_out":21}
{"sheet":"Layout","index":4,"n_rows":0,"n_cols":0,"rows_kept":0,"cut":false,"hidden":false,"merged":[]}

{"sheet":"Instructions","index":5,"n_rows":12,"n_cols":3,"rows_kept":12,"cut":false,"hidden":false,"merged":[]}
[]
[null,"Instructions"]
[]
[null,1,{"$f":"CONCATENATE(\"Cut out the side panels, \",Design!$E$51,\"cm x \",Design!$F$51,\"cm (2 are required)\")","v":"Cut out the side panels, 120.7cm x 76.8cm (2 are required)"}]
[null,{"$f":"B4+1","v":2},"Draw out the guides on the side panels as illustrated. One panel must mirror the other"]
[null,3,{"$f":"CONCATENATE(\"Prepare the speaker baffle.  This panel should be \",ROUND(Design!$E$50,1),\"cm x \",ROUND(Design!$F$50,1),\" cm. Cut the mounting hole for the speaker so that it is \",Design!D18,\" cm from one of the ends that measures \",Design!E49,\" cm.\")","v":"Prepare the speaker baffle.  This panel should be 57.2cm x 47.5 cm. Cut the mounting hole for the speaker so that it is 18 cm from one of the ends that measures 57.2 cm."}]
[null,4,"Using the guides on the side panel, join the speaker baffle and all of the internal panels to the side panel."]
[null,5,"Cut out and join all the rest of the bracing panels to the internal panels."]
[null,6,{"$f":"CONCATENATE(\"Cut out the front panel (\",ROUND(Design!E53,1),\"cm x \",ROUND(Design!F53,1),\"cm), top and bottom panels (\",ROUND(Design!E49,1),\"cm x \",ROUND(Design!F49,1),\"cm), and back panel (\",ROUND(Design!E52,1),\"cm x \",ROUND(Design!F52,1),\"cm)\")","v":"Cut out the front panel (57.2cm x 83.2cm), top and bottom panels (57.2cm x 76.8cm), and back panel (57.2cm x 116.9cm)"}]
[null,7,"Join the front panel, top and bottom panels and back panels to the side panel to which the other panels have already been joined.  "]
{"$rows_left_out":3}
{"sheet":"Bracing","index":6,"n_rows":24,"n_cols":28,"rows_kept":24,"cut":false,"hidden":false,"merged":[]}
["Bracing",null,"x","y",null,"x","y",null,null,null,null,null,null,null,null,null,null,null,"Intersection points"]
[null,null,{"$f":"C8","v":67.425725035915377},{"$f":"D8","v":24.719753029129816},null,{"$f":"IF(Design!$H$21=\"x\",C2,0)","v":0},{"$f":"IF(Design!$H$21=\"x\",D2,0)","v":0}]
[null,1,{"$f":"C4","v":88.711643312677907},{"$f":"Panels!D60","v":46.329287296147569},null,{"$f":"IF(Design!$H$21=\"x\",C3,0)","v":0},{"$f":"IF(Design!$H$21=\"x\",D3,0)","v":0},null,null,null,null,null,null,null,null,null,null,null,null,"x1","y1","x2","y2","a","b","x","y","l"]
[null,null,{"$f":"Panels!C70","v":88.711643312677907},{"$f":"Panels!D25","v":1.9},null,{"$f":"IF(Design!$H$21=\"x\",C4,0)","v":0},{"$f":"IF(Design!$H$21=\"x\",D4,0)","v":0},null,null,null,null,null,null,null,null,null,null,null,"Guide 1",{"$f":"Guides!C9","v":105.48041079869948},{"$f":"Guides!D9","v":0},{"$f":"Guides!C8","v":109.13472187516774},{"$f":"Guides!D8","v":76.835000000000036},{"$f":"(W4-U4)/(V4-T4)","v":21.025850944867521},{"$f":"(W4*T4-U4*V4)/(T4-V4)","v":-2217.8153950568499}]
[null,null,{"$f":"Panels!C24","v":1.9},{"$f":"Panels!D24","v":1.9},null,{"$f":"IF(Design!$H$21=\"x\",C5,0)","v":0},{"$f":"IF(Design!$H$21=\"x\",D5,0)","v":0},null,null,null,null,null,null,null,null,null,null,null,"Guide 2",{"$f":"Guides!C23","v":0},{"$f":"Guides!D23","v":48.229287296147568},{"$f":"Guides!C24","v":120.65},{"$f":"Guides!D24","v":48.229287296147568},{"$f":"(W5-U5)/(V5-T5)","v":0},{"$f":"(W5*T5-U5*V5)/(T5-V5)","v":48.229287296147568},{"$f":"(Y4-Y5)/(X5-X4)","v":107.77421985416225},{"$f":"Z5*X5+Y5","v":48.229287296147568},{"$f":"(Z5^2+AA5^2)^0.5","v":118.07347974150521}]
[null,null,{"$f":"C5","v":1.9},{"$f":"(Guides!D20+Guides!D14)/2","v":50.263795785567936},null,{"$f":"IF(Design!$H$21=\"x\",C6,0)","v":0},{"$f":"IF(Design!$H$21=\"x\",D6,0)","v":0}]
[null,null,{"$f":"Z8","v":29.659082142302481},{"$f":"AA8","v":27.78639144761064},null,{"$f":"IF(Design!$H$21=\"x\",C7,0)","v":0},{"$f":"IF(Design!$H$21=\"x\",D7,0)","v":0},null,null,null,null,null,null,null,null,null,null,null,"Guide 3",{"$f":"Guides!C14","v":0},{"$f":"Guides!D14","v":30.194698720530731},{"$f":"Guides!C15","v":120.65},{"$f":"Guides!D15","v":20.397960200986937},{"$f":"(W7-U7)/(V7-T7)","v":-8.1199656191825897E-2},{"$f":"(W7*T7-U7*V7)/(T7-V7)","v":30.194698720530731}]
[null,null,{"$f":"Panels!C44","v":67.425725035915377},{"$f":"Panels!D44","v":24.719753029129816},null,{"$f":"IF(Design!$H$21=\"x\",C8,0)","v":0},{"$f":"IF(Design!$H$21=\"x\",D8,0)","v":0},null,null,null,null,null,null,null,null,null,null,null,"Panel B",{"$f":"Panels!C36","v":33.654298627389551},{"$f":"Panels!D36","v":76.98877323662677},{"$f":"Panels!C37","v":29.81285537892925},{"$f":"Panels!D37","v":29.68015853775065},{"$f":"(W8-U8)/(V8-T8)","v":12.31532308015692},{"$f":"(W8*T8-U8*V8)/(T8-V8)","v":-337.47478739575706},{"$f":"(Y7-Y8)/(X8-X7)","v":29.659082142302481},{"$f":"Z8*X8+Y8","v":27.78639144761064},{"$f":"(Z8^2+AA8^2)^0.5","v":40.641662160936477}]
[null,null,{"$f":"C2","v":67.425725035915377},{"$f":"D2","v":24.719753029129816},null,{"$f":"IF(Design!$H$21=\"x\",C9,0)","v":0},{"$f":"IF(Design!$H$21=\"x\",D9,0)","v":0}]
[null,null,null,null,null,null,null,null,null,null,null,null,null,null,null,null,null,null,"Guide 3",{"$f":"Guides!C8","v":109.13472187516774},{"$f":"Guides!D8","v":76.835000000000036},{"$f":"Guides!C9","v":105.48041079869948},{"$f":"Guides!D9","v":0},{"$f":"(W10-U10)/(V10-T10)","v":21.025850944867521},{"$f":"(W10*T10-U10*V10)/(T10-V10)","v":-2217.8153950568499}]
{"$rows_left_out":14}