{"text_format":"1","workbook":"xlsx","n_sheets":3,"sheets":["Information","Panel Calculations","Path Calculations"],"not_rendered":{"charts":3,"images":0,"macros":1,"external_links":0,"defined_names":0,"comments":0,"pivot_tables":0},"unopened":[],"bounds":{"document_bytes":16777216,"sheet_cells":100000,"rows_first":2000,"rows_last":500,"rows_between":2000,"halvings":0,"cell_chars":16384,"cell_head_chars":4096},"cells_cut":0,"cells_raw":0,"read":"whole","date_system":"1900"}

{"sheet":"Information","index":0,"n_rows":96,"n_cols":22,"rows_kept":96,"cut":false,"hidden":false,"merged":[[84,3,84,7],[85,3,85,7],[86,3,86,7],[63,3,63,7],[62,3,62,7],[68,3,68,7],[79,3,79,7],[80,3,80,7],[81,3,81,7],[82,3,82,7],[83,3,83,7],[74,3,74,7],[75,3,75,7],[76,3,76,7],[77,3,77,7],[78,3,78,7],[69,3,69,7],[70,3,70,7],[71,3,71,7],[72,3,72,7],[73,3,73,7],[64,3,64,7],[65,3,65,7],[66,3,66,7],[67,3,67,7],[59,3,59,7],[60,3,60,7],[61,3,61,7],[54,3,54,7],[55,3,55,7],[56,3,56,7],[57,3,57,7],[58,3,58,7],[49,3,49,7],[50,3,50,7],[51,3,51,7],[52,3,52,7],[53,3,53,7],[4,8,4,10],[5,8,5,10],[6,8,6,10],[7,8,7,10],[47,3,47,17]]}
[null,"Straight TL (1)","=",0.1]
[]
[null,"Driver Dimensions"]
[null,"Frame Width","=",{"$f":"8.5*2.54","v":21.59},"cm",{"$f":"D4/2.54","v":8.5},"in",null,"Plot"]
[null,"Mounting Width","=",{"$f":"7.1*2.54","v":18.033999999999999},"cm",{"$f":"D5/2.54","v":7.1},"in","x","Panel A, front baffle"]
[null,"Mounting Depth","=",{"$f":"4*2.54","v":10.16},"cm",{"$f":"D6/2.54","v":4},"in","x","Panel B, rear baffle"]
[null,"Magnet Width","=",{"$f":"6*2.54","v":15.24},"cm",{"$f":"D7/2.54","v":6},"in","x","Panel C, top, bottom"]
[null,"Magnet Height","=",{"$f":"2*2.54","v":5.08},"cm",{"$f":"D8/2.54","v":2},"in","x","Panel D, rear panel"]
[null,null,null,null,null,null,null,"o","Panel E, side panels"]
[null,"Box Parameters",null,null,null,null,null,"x","Panel F, 1st internal"]
[null,"Width (external)","=",{"$f":"10*2.54","v":25.4},"cm",{"$f":"D11/2.54","v":10},"in","x","Panel G, 2nd internal"]
[null,"Depth (External)","=",{"$f":"15*2.54","v":38.1},"cm",15,"in","x","Panel H, 2nd internal"]
[null,"Height (External)","=",{"$f":"49*2.54","v":124.46000000000001},"cm",49,"in"]
[null,"Panel Thickness","=",{"$f":"0.75*2.54","v":1.905},"cm",0.75,"in",null,"Plot"]
[null,"Panel A Offset","=",0,"cm",0,"in","x","Advanced Centerline"]
[null,"Driver Offset","=",4,"cm",1.5748031496062991,"in","x","Sample points"]
[null,null,null,null,null,null,null,"x","Driver"]
[null,"Total Vent Area","=",{"$f":"(D12-5*D14-D15)*(D11-2*D14)/3","v":205.64475000000002},"cm^2",{"$f":"D18/(2.54^2)","v":31.875000000000004},"in^2"]
[null,"Baffle Width","=",{"$f":"D11-2*D40","v":21.59},"cm",{"$f":"D19/2.54","v":8.5},"in"]
[null,"Vent Height","=",{"$f":"D18/D19","v":9.5250000000000004},"cm",{"$f":"D20/2.54","v":3.75},"in"]
[]
[null,"HornResp Params"]
[null,"S1","=",{"$f":"'Path Calculations'!$P$8","v":205.64475000000002},"cm^2"]
[null,"S2","=",{"$f":"D23","v":205.64475000000002},"cm^2"]
[null,"S3","=",{"$f":"'Path Calculations'!P74","v":205.64475000000002},"cm^2"]
[null,"L12","=",{"$f":"D16+D4/2","v":14.795},"cm",{"$f":"D26/2.54","v":5.8248031496062991},"in"]
[null,"L23","=",{"$f":"'Path Calculations'!O74-D26","v":347.80048022700475},"cm",{"$f":"D27/2.54","v":136.92932292401761},"in"]
[null,"L (actual)","=",{"$f":"SUM(D26:D27)","v":362.59548022700477},"cm",{"$f":"D28/2.54","v":142.75412607362392},"in"]
[]
[null,"L/L12 ratio","=",{"$f":"D28/D26","v":24.507974330990521}]
[]
[null,"Box Design"]
[null,"Vol. (net)","=",{"$f":"D34-I45","v":80.575193687999999},"l.",{"$f":"(D33*1000/2.54^3)/1728","v":2.8454861111111112},"cu.ft."]
[null,"Vol. (gross)","=",{"$f":"D11*D12*D13/1000","v":120.4449204},"l.",{"$f":"D34*0.0353","v":4.2517056901199997},"cu.ft."]
[null,"Panels",null,"p","x","y",null,"#","v"]
[null,{"$f":"I5","v":"Panel A, front baffle"},null,{"$f":"$D$14","v":1.905},{"$f":"D19","v":21.59},{"$f":"'Panel Calculations'!K26","v":109.22000000000001},null,1,{"$f":"F36*E36*D36*H36/10^3","v":4.4921039190000007}]
[null,"Panel B, rear baffle",null,{"$f":"$D$14","v":1.905},{"$f":"E36","v":21.59},{"$f":"'Panel Calculations'!K47","v":109.22000000000001},null,1,4.4921039190000007]
[null,"Panel C, top, bottom",null,{"$f":"$D$14","v":1.905},{"$f":"E37+2*D15","v":21.59},{"$f":"'Panel Calculations'!K62","v":38.1},null,2,3.13402599]
[null,"Panel D, rear panel",null,{"$f":"D14","v":1.905},{"$f":"E37","v":21.59},{"$f":"'Panel Calculations'!K75","v":120.65},null,1,4.9622078175000004]
[null,"Panel E, side panels",null,{"$f":"$D$14","v":1.905},{"$f":"'Panel Calculations'!K80","v":38.1},{"$f":"'Panel Calculations'!K81","v":120.65},null,2,{"$f":"F40*E40*D40*H40/10^3","v":17.513674650000002}]
[null,"Panel F, 1st internal",null,{"$f":"$D$14","v":1.905},{"$f":"E39","v":21.59},{"$f":"'Panel Calculations'!K86","v":26.67},null,1,{"$f":"F41*E41*D41*H41/10^3","v":1.0969090965000001}]
[null,"Panel G, 2nd internal",null,{"$f":"$D$14","v":1.905},{"$f":"E41","v":21.59},{"$f":"'Panel Calculations'!K92","v":99.695000000000007},null,1,{"$f":"F42*E42*D42*H42/10^3","v":4.1003506702500001}]
[null,"Panel H, 2nd internal",null,{"$f":"$D$14","v":1.905},{"$f":"E42","v":21.59},{"$f":"'Panel Calculations'!K93","v":1.9050000000000011},null,1,{"$f":"F43*E43*D43*H43/10^3","v":7.8350649750000043E-2}]
[null,"(Offset)",null,{"$f":"D15","v":0},{"$f":"E42","v":21.59},{"$f":"F36","v":109.22000000000001},null,1,{"$f":"F44*E44*D44*H44/10^3","v":0}]
[null,null,null,null,null,null,null,"Pnl Vol",{"$f":"SUM(I36:I44)","v":39.869726712000002},"l"]
[]
[]
[null,"Filename","=","I:\\Users\\Brian.Steele\\OneDrive\\Hornresp\\Import\\BOXPLAN.TXT"]
[]
[null,"ID","=","29.00",null,null,null,null,null,{"$f":"CONCATENATE(B50,C50,D50)","v":"ID=29.00"}]
[null,"Ang","=","2.0 x PI",null,null,null,null,null,{"$f":"CONCATENATE(B51,C51,D51)","v":"Ang=2.0 x PI"}]
[null,"Eg","=",2.83,null,null,null,null,null,"Eg=2.83"]
[null,"Rg","=",0,null,null,null,null,null,"Rg=0"]
[null,"Fta","=",0,null,null,null,null,null,"Fta=0"]
[null,"S1","=",{"$f":"ROUND(D23,0)","v":206},null,null,null,null,null,"S1=206"]
[null,"S2","=",{"$f":"ROUND(D24,0)","v":206},null,null,null,null,null,"S2=206"]
[null,"Par","=",{"$f":"ROUND(D26,1)","v":14.8},null,null,null,null,null,"Par=14.8"]
[null,"F12","=",0,null,null,null,null,null,"F12=0"]
[null,"S2","=",{"$f":"D56","v":206},null,null,null,null,null,"S2=206"]
[null,"S3","=",{"$f":"ROUND(D25,0)","v":206},null,null,null,null,null,"S3=206"]
[null,"Par","=",{"$f":"ROUND(D27,1)","v":347.8},null,null,null,null,null,"Par=347.8"]
[null,"F23","=",0,null,null,null,null,null,"F23=0"]
[null,"S3","=",0,null,null,null,null,null,"S3=0"]
[null,"S4","=",0,null,null,null,null,null,"S4=0"]
[null,"L34","=",0,null,null,null,null,null,"L34=0"]
[null,"F34","=",0,null,null,null,null,null,"F34=0"]
[null,"S4","=",{"$f":"D64","v":0},null,null,null,null,null,"S4=0"]
[null,"S5","=",0,null,null,null,null,null,"S5=0"]
[null,"L45","=",0,null,null,null,null,null,{"$f":"CONCATENATE(B69,C69,D69)","v":"L45=0"}]
[null,"F45","=",0,null,null,null,null,null,"F45=0"]
[null,"Sd","=",182,null,null,null,null,null,"Sd=182"]
[null,"Bl","=",7.16,null,null,null,null,null,"Bl=7.16"]
[null,"Cms","=",5.7399999999999997E-4,null,null,null,null,null,"Cms=0.000574"]
[null,"Rms","=",2.89,null,null,null,null,null,"Rms=2.89"]
[null,"Mmd","=",83.47,null,null,null,null,null,"Mmd=83.47"]
[null,"Le","=",1,null,null,null,null,null,"Le=1"]
[null,"Re","=",1.6,null,null,null,null,null,"Re=1.6"]
[null,"OD","=",1,null,null,null,null,null,"OD=1"]
[null,"Vrc","=",0,null,null,null,null,null,"Vrc=0"]
[null,"Lrc","=",0,null,null,null,null,null,"Lrc=0"]
[null,"Ap1","=",0,null,null,null,null,null,"Ap1=0"]
[null,"Lp","=",0,null,null,null,null,null,"Lp=0"]
[null,"Vtc","=",0,null,null,null,null,null,"Vtc=0"]
[null,"Atc","=",0,null,null,null,null,null,"Atc=0"]
[null,"Pmax","=",300,null,null,null,null,null,"Pmax=300"]
[null,"Xmax","=",8,null,null,null,null,null,"Xmax=8"]
[null,"Comment","=","BOXPLAN-Export (Straight TL v1)",null,null,null,null,null,"Comment=BOXPLAN-Export (Straight TL v1)"]
[]
[]
[]
[]
[null,null,null,null,null,null,null,null,null,null,null,null,null,null,null,null,null,null,null,"Axes","x","y"]
[null,null,null,null,null,null,null,null,null,null,null,null,null,null,null,null,null,null,null,"Axis 1",0,0]
[null,null,null,null,null,null,null,null,null,null,null,null,null,null,null,null,null,null,null,null,{"$f":"U93","v":0},{"$f":"MAX('Panel Calculations'!C3:D89)","v":124.46000000000001}]
[null,null,null,null,null,null,null,null,null,null,null,null,null,null,null,null,null,null,null,"Axis 2",0,0]
[null,null,null,null,null,null,null,null,null,null,null,null,null,null,null,null,null,null,null,null,{"$f":"V94","v":124.46000000000001},{"$f":"V95","v":0}]

{"sheet":"Panel Calculations","index":1,"n_rows":101,"n_cols":11,"rows_kept":101,"cut":false,"hidden":false,"merged":[]}
[]
[null,"Offset","x","y"]
[null,null,0,0]
[]
[null,"Driver","x","y"]
[null,null,{"$f":"C33","v":1.905},{"$f":"D26-Information!D4-Information!D16","v":96.965000000000003},null,{"$f":"IF(Information!$H$17=\"x\",'Panel Calculations'!C6,\"\")","v":1.905},{"$f":"IF(Information!$H$17=\"x\",'Panel Calculations'!D6,\"\")","v":96.965000000000003}]
[null,null,{"$f":"C6","v":1.905},{"$f":"D6+Information!D4","v":118.55500000000001},null,{"$f":"IF(Information!$H$17=\"x\",'Panel Calculations'!C7,\"\")","v":1.905},{"$f":"IF(Information!$H$17=\"x\",'Panel Calculations'!D7,\"\")","v":118.55500000000001}]
[null,null,{"$f":"C7","v":1.905},{"$f":"D7-(Information!D4-Information!D5)/2","v":116.777},null,{"$f":"IF(Information!$H$17=\"x\",'Panel Calculations'!C8,\"\")","v":1.905},{"$f":"IF(Information!$H$17=\"x\",'Panel Calculations'!D8,\"\")","v":116.777}]
[null,null,{"$f":"C8+Information!D6-Information!D8","v":6.9849999999999994},{"$f":"D8-(Information!D5-Information!D7)/2","v":115.38},null,{"$f":"IF(Information!$H$17=\"x\",'Panel Calculations'!C9,\"\")","v":6.9849999999999994},{"$f":"IF(Information!$H$17=\"x\",'Panel Calculations'!D9,\"\")","v":115.38}]
[null,null,{"$f":"C9+Information!D8","v":12.065},{"$f":"D9","v":115.38},null,{"$f":"IF(Information!$H$17=\"x\",'Panel Calculations'!C10,\"\")","v":12.065},{"$f":"IF(Information!$H$17=\"x\",'Panel Calculations'!D10,\"\")","v":115.38}]
[null,null,{"$f":"C10","v":12.065},{"$f":"D10-Information!D7","v":100.14},null,{"$f":"IF(Information!$H$17=\"x\",'Panel Calculations'!C11,\"\")","v":12.065},{"$f":"IF(Information!$H$17=\"x\",'Panel Calculations'!D11,\"\")","v":100.14}]
[null,null,{"$f":"C9","v":6.9849999999999994},{"$f":"D11","v":100.14},null,{"$f":"IF(Information!$H$17=\"x\",'Panel Calculations'!C12,\"\")","v":6.9849999999999994},{"$f":"IF(Information!$H$17=\"x\",'Panel Calculations'!D12,\"\")","v":100.14}]
[null,null,{"$f":"C8","v":1.905},{"$f":"D6+(Information!D4-Information!D5)/2","v":98.743000000000009},null,{"$f":"IF(Information!$H$17=\"x\",'Panel Calculations'!C13,\"\")","v":1.905},{"$f":"IF(Information!$H$17=\"x\",'Panel Calculations'!D13,\"\")","v":98.743000000000009}]
[null,null,{"$f":"C13","v":1.905},{"$f":"D6+Information!D4/2","v":107.76},null,{"$f":"IF(Information!$H$17=\"x\",'Panel Calculations'!C14,\"\")","v":1.905},{"$f":"IF(Information!$H$17=\"x\",'Panel Calculations'!D14,\"\")","v":107.76}]
[null,null,{"$f":"C12","v":6.9849999999999994},{"$f":"D14","v":107.76},null,{"$f":"IF(Information!$H$17=\"x\",'Panel Calculations'!C15,\"\")","v":6.9849999999999994},{"$f":"IF(Information!$H$17=\"x\",'Panel Calculations'!D15,\"\")","v":107.76}]
[null,null,{"$f":"C15","v":6.9849999999999994},{"$f":"D12","v":100.14},null,{"$f":"IF(Information!$H$17=\"x\",'Panel Calculations'!C16,\"\")","v":6.9849999999999994},{"$f":"IF(Information!$H$17=\"x\",'Panel Calculations'!D16,\"\")","v":100.14}]
[null,null,{"$f":"C16","v":6.9849999999999994},{"$f":"D10","v":115.38},null,{"$f":"IF(Information!$H$17=\"x\",'Panel Calculations'!C17,\"\")","v":6.9849999999999994},{"$f":"IF(Information!$H$17=\"x\",'Panel Calculations'!D17,\"\")","v":115.38}]
[]
[null,"X-axis",{"$f":"C3","v":0},{"$f":"D3","v":0}]
[null,null,{"$f":"MAX(C25:D101)","v":124.46000000000001},{"$f":"D19","v":0}]
[]
[null,"Y-axis",{"$f":"C19","v":0},{"$f":"D19","v":0}]
[null,null,{"$f":"C22","v":0},{"$f":"C20","v":124.46000000000001}]
[null,null,null,null,null,null,null,null,"dx","dy"]
[null,{"$f":"IF(Information!H5=\"x\",Information!I5,\"\")","v":"Panel A, front baffle"},{"$f":"Information!D15","v":0},{"$f":"D31","v":13.334999999999999},null,{"$f":"IF($B25<>\"\",C25,0)","v":0},{"$f":"IF($B25<>\"\",D25,0)","v":13.334999999999999}]
[null,null,{"$f":"C25","v":0},{"$f":"D67","v":122.55500000000001},null,{"$f":"IF($B25<>\"\",C26,0)","v":0},{"$f":"IF($B25<>\"\",D26,0)","v":122.55500000000001},null,{"$f":"C25-C26","v":0},-109.22000000000001,{"$f":"(I26^2+J26^2)^0.5","v":109.22000000000001}]
[null,null,{"$f":"C26+Information!D36","v":1.905},{"$f":"D26","v":122.55500000000001},null,{"$f":"IF($B25<>\"\",C27,0)","v":1.905},{"$f":"IF($B25<>\"\",D27,0)","v":122.55500000000001},null,-1.905,0,{"$f":"(I27^2+J27^2)^0.5","v":1.905}]
[null,null,{"$f":"C25","v":0},{"$f":"D27","v":122.55500000000001},null,{"$f":"IF($B25<>\"\",C28,0)","v":0},{"$f":"IF($B25<>\"\",D28,0)","v":122.55500000000001},null,1.905,0,{"$f":"(I28^2+J28^2)^0.5","v":1.905}]
[null,null,{"$f":"C25","v":0},{"$f":"D25","v":13.334999999999999},null,{"$f":"IF($B25<>\"\",C29,0)","v":0},{"$f":"IF($B25<>\"\",D29,0)","v":13.334999999999999},null,0,109.22000000000001,{"$f":"(I29^2+J29^2)^0.5","v":109.22000000000001}]
[]
[null,{"$f":"IF(Information!H5=\"x\",Information!I5,\"\")","v":"Panel A, front baffle"},{"$f":"C25","v":0},{"$f":"D88","v":13.334999999999999},null,{"$f":"IF($B31<>\"\",C31,0)","v":0},{"$f":"IF($B31<>\"\",D31,0)","v":13.334999999999999}]
[null,null,{"$f":"C26","v":0},{"$f":"D6","v":96.965000000000003},null,{"$f":"IF($B31<>\"\",C32,0)","v":0},{"$f":"IF($B31<>\"\",D32,0)","v":96.965000000000003},null,{"$f":"C31-C32","v":0},-83.63000000000001,{"$f":"(I32^2+J32^2)^0.5","v":83.63000000000001}]
[null,null,{"$f":"C32+Information!D36","v":1.905},{"$f":"D32","v":96.965000000000003},null,{"$f":"IF($B31<>\"\",C33,0)","v":1.905},{"$f":"IF($B31<>\"\",D33,0)","v":96.965000000000003},null,-1.905,0,{"$f":"(I33^2+J33^2)^0.5","v":1.905}]
[null,null,{"$f":"C33","v":1.905},{"$f":"D31","v":13.334999999999999},null,{"$f":"IF($B31<>\"\",C34,0)","v":1.905},{"$f":"IF($B31<>\"\",D34,0)","v":13.334999999999999},null,0,83.63000000000001,{"$f":"(I34^2+J34^2)^0.5","v":83.63000000000001}]
[null,null,{"$f":"C31","v":0},{"$f":"D31","v":13.334999999999999},null,{"$f":"IF($B31<>\"\",C35,0)","v":0},{"$f":"IF($B31<>\"\",D35,0)","v":13.334999999999999},null,1.905,0,{"$f":"(I35^2+J35^2)^0.5","v":1.905}]
[]
[null,{"$f":"IF(Information!H5=\"x\",Information!I5,\"\")","v":"Panel A, front baffle"},{"$f":"C25","v":0},{"$f":"D26","v":122.55500000000001},null,{"$f":"IF($B37<>\"\",C37,0)","v":0},{"$f":"IF($B37<>\"\",D37,0)","v":122.55500000000001}]
[null,null,{"$f":"C37","v":0},{"$f":"D7","v":118.55500000000001},null,{"$f":"IF($B37<>\"\",C38,0)","v":0},{"$f":"IF($B37<>\"\",D38,0)","v":118.55500000000001},null,{"$f":"C37-C38","v":0},4,{"$f":"(I38^2+J38^2)^0.5","v":4}]
[null,null,{"$f":"C33","v":1.905},{"$f":"D38","v":118.55500000000001},null,{"$f":"IF($B37<>\"\",C39,0)","v":1.905},{"$f":"IF($B37<>\"\",D39,0)","v":118.55500000000001},null,-1.905,0,{"$f":"(I39^2+J39^2)^0.5","v":1.905}]
[null,null,{"$f":"C34","v":1.905},{"$f":"D37","v":122.55500000000001},null,{"$f":"IF($B37<>\"\",C40,0)","v":1.905},{"$f":"IF($B37<>\"\",D40,0)","v":122.55500000000001},null,0,-4,{"$f":"(I40^2+J40^2)^0.5","v":4}]
[null,null,{"$f":"C37","v":0},{"$f":"D37","v":122.55500000000001},null,{"$f":"IF($B37<>\"\",C41,0)","v":0},{"$f":"IF($B37<>\"\",D41,0)","v":122.55500000000001},null,1.905,0,{"$f":"(I41^2+J41^2)^0.5","v":1.905}]
[]
[null,{"$f":"IF(Information!H6=\"x\",Information!I6,\"\")","v":"Panel B, rear baffle"},{"$f":"C39","v":1.905},{"$f":"D31","v":13.334999999999999},null,{"$f":"IF($B43<>\"\",C43,0)","v":1.905},{"$f":"IF($B43<>\"\",D43,0)","v":13.334999999999999}]
[null,null,{"$f":"C43+Information!D14","v":3.81},{"$f":"D43","v":13.334999999999999},null,{"$f":"IF($B43<>\"\",C44,0)","v":3.81},{"$f":"IF($B43<>\"\",D44,0)","v":13.334999999999999},null,{"$f":"C43-C44","v":-1.905},0,{"$f":"(I44^2+J44^2)^0.5","v":1.905}]
[null,null,{"$f":"C44","v":3.81},{"$f":"D67","v":122.55500000000001},null,{"$f":"IF($B43<>\"\",C45,0)","v":3.81},{"$f":"IF($B43<>\"\",D45,0)","v":122.55500000000001},null,0,-109.22000000000001,{"$f":"(I45^2+J45^2)^0.5","v":109.22000000000001}]
[null,null,{"$f":"C43","v":1.905},{"$f":"D45","v":122.55500000000001},null,{"$f":"IF($B43<>\"\",C46,0)","v":1.905},{"$f":"IF($B43<>\"\",D46,0)","v":122.55500000000001},null,1.905,0,{"$f":"(I46^2+J46^2)^0.5","v":1.905}]
[null,null,{"$f":"C43","v":1.905},{"$f":"D43","v":13.334999999999999},null,{"$f":"IF($B43<>\"\",C47,0)","v":1.905},{"$f":"IF($B43<>\"\",D47,0)","v":13.334999999999999},null,0,109.22000000000001,{"$f":"(I47^2+J47^2)^0.5","v":109.22000000000001}]
[]
[null,{"$f":"IF(Information!H6=\"x\",Information!I6,\"\")","v":"Panel B, rear baffle"},{"$f":"C40","v":1.905},{"$f":"D40","v":122.55500000000001},null,{"$f":"IF($B49<>\"\",C49,0)","v":1.905},{"$f":"IF($B49<>\"\",D49,0)","v":122.55500000000001}]
[null,null,{"$f":"C49+Information!D14","v":3.81},{"$f":"D49","v":122.55500000000001},null,{"$f":"IF($B49<>\"\",C50,0)","v":3.81},{"$f":"IF($B49<>\"\",D50,0)","v":122.55500000000001},null,{"$f":"C49-C50","v":-1.905},0,{"$f":"(I50^2+J50^2)^0.5","v":1.905}]
[null,null,{"$f":"C50","v":3.81},{"$f":"D8","v":116.777},null,{"$f":"IF($B49<>\"\",C51,0)","v":3.81},{"$f":"IF($B49<>\"\",D51,0)","v":116.777},null,0,5.7780000000000058,{"$f":"(I51^2+J51^2)^0.5","v":5.7780000000000058}]
[null,null,{"$f":"C49","v":1.905},{"$f":"D51","v":116.777},null,{"$f":"IF($B49<>\"\",C52,0)","v":1.905},{"$f":"IF($B49<>\"\",D52,0)","v":116.777},null,1.905,0,{"$f":"(I52^2+J52^2)^0.5","v":1.905}]
[null,null,{"$f":"C49","v":1.905},{"$f":"D49","v":122.55500000000001},null,{"$f":"IF($B49<>\"\",C53,0)","v":1.905},{"$f":"IF($B49<>\"\",D53,0)","v":122.55500000000001},null,0,-5.7780000000000058,{"$f":"(I53^2+J53^2)^0.5","v":5.7780000000000058}]
[]
[null,{"$f":"IF(Information!H6=\"x\",Information!I6,\"\")","v":"Panel B, rear baffle"},{"$f":"C46","v":1.905},{"$f":"D43","v":13.334999999999999},null,{"$f":"IF($B55<>\"\",C55,0)","v":1.905},{"$f":"IF($B55<>\"\",D55,0)","v":13.334999999999999}]
[null,null,{"$f":"C52","v":1.905},{"$f":"D13","v":98.743000000000009},null,{"$f":"IF($B55<>\"\",C56,0)","v":1.905},{"$f":"IF($B55<>\"\",D56,0)","v":98.743000000000009},null,{"$f":"C55-C56","v":0},-85.408000000000015,{"$f":"(I56^2+J56^2)^0.5","v":85.408000000000015}]
[null,null,{"$f":"C51","v":3.81},{"$f":"D56","v":98.743000000000009},null,{"$f":"IF($B55<>\"\",C57,0)","v":3.81},{"$f":"IF($B55<>\"\",D57,0)","v":98.743000000000009},null,-1.905,0,{"$f":"(I57^2+J57^2)^0.5","v":1.905}]
[null,null,{"$f":"C44","v":3.81},{"$f":"D55","v":13.334999999999999},null,{"$f":"IF($B55<>\"\",C58,0)","v":3.81},{"$f":"IF($B55<>\"\",D58,0)","v":13.334999999999999},null,0,85.408000000000015,{"$f":"(I58^2+J58^2)^0.5","v":85.408000000000015}]
[null,null,{"$f":"C55","v":1.905},{"$f":"D55","v":13.334999999999999},null,{"$f":"IF($B55<>\"\",C59,0)","v":1.905},{"$f":"IF($B55<>\"\",D59,0)","v":13.334999999999999},null,1.905,0,{"$f":"(I59^2+J59^2)^0.5","v":1.905}]
[]
[null,{"$f":"IF(Information!H17=\"x\",Information!I7,\"\")","v":"Panel C, top, bottom"},0,{"$f":"D3","v":0},null,{"$f":"IF($B61<>\"\",C61,0)","v":0},{"$f":"IF($B61<>\"\",D61,0)","v":0}]
[null,null,{"$f":"C61+Information!D12","v":38.1},{"$f":"D61","v":0},null,{"$f":"IF($B61<>\"\",C62,0)","v":38.1},{"$f":"IF($B61<>\"\",D62,0)","v":0},null,{"$f":"C61-C62","v":-38.1},0,{"$f":"(I62^2+J62^2)^0.5","v":38.1}]
[null,null,{"$f":"C62","v":38.1},{"$f":"D62+Information!D14","v":1.905},null,{"$f":"IF($B61<>\"\",C63,0)","v":38.1},{"$f":"IF($B61<>\"\",D63,0)","v":1.905},null,0,-1.905,{"$f":"(I63^2+J63^2)^0.5","v":1.905}]
[null,null,{"$f":"C61","v":0},{"$f":"D63","v":1.905},null,{"$f":"IF($B61<>\"\",C64,0)","v":0},{"$f":"IF($B61<>\"\",D64,0)","v":1.905},null,38.1,0,{"$f":"(I64^2+J64^2)^0.5","v":38.1}]
[null,null,{"$f":"C61","v":0},{"$f":"D61","v":0},null,{"$f":"IF($B61<>\"\",C65,0)","v":0},{"$f":"IF($B61<>\"\",D65,0)","v":0},null,0,1.905,{"$f":"(I65^2+J65^2)^0.5","v":1.905}]
[]
[null,{"$f":"IF(Information!H7=\"x\",Information!I7,\"\")","v":"Panel C, top, bottom"},{"$f":"C61","v":0},{"$f":"D75","v":122.55500000000001},null,{"$f":"IF($B67<>\"\",C67,0)","v":0},{"$f":"IF($B67<>\"\",D67,0)","v":122.55500000000001}]
[null,null,{"$f":"C62","v":38.1},{"$f":"D67","v":122.55500000000001},null,{"$f":"IF($B67<>\"\",C68,0)","v":38.1},{"$f":"IF($B67<>\"\",D68,0)","v":122.55500000000001},null,{"$f":"C67-C68","v":-38.1},0,{"$f":"(I68^2+J68^2)^0.5","v":38.1}]
[null,null,{"$f":"C68","v":38.1},{"$f":"D68+Information!D38","v":124.46000000000001},null,{"$f":"IF($B67<>\"\",C69,0)","v":38.1},{"$f":"IF($B67<>\"\",D69,0)","v":124.46000000000001},null,0,-1.9050000000000011,{"$f":"(I69^2+J69^2)^0.5","v":1.9050000000000011}]
[null,null,{"$f":"C67","v":0},{"$f":"D69","v":124.46000000000001},null,{"$f":"IF($B67<>\"\",C70,0)","v":0},{"$f":"IF($B67<>\"\",D70,0)","v":124.46000000000001},null,38.1,0,{"$f":"(I70^2+J70^2)^0.5","v":38.1}]
[null,null,{"$f":"C67","v":0},{"$f":"D67","v":122.55500000000001},null,{"$f":"IF($B67<>\"\",C71,0)","v":0},{"$f":"IF($B67<>\"\",D71,0)","v":122.55500000000001},null,0,1.9050000000000011,{"$f":"(I71^2+J71^2)^0.5","v":1.9050000000000011}]
[]
[null,{"$f":"IF(Information!H8=\"x\",Information!I8,\"\")","v":"Panel D, rear panel"},{"$f":"C68","v":38.1},{"$f":"D63","v":1.905},null,{"$f":"IF($B73<>\"\",C73,0)","v":38.1},{"$f":"IF($B73<>\"\",D73,0)","v":1.905}]
[null,null,{"$f":"C73-Information!D39","v":36.195},{"$f":"D73","v":1.905},null,{"$f":"IF($B73<>\"\",C74,0)","v":36.195},{"$f":"IF($B73<>\"\",D74,0)","v":1.905},null,{"$f":"C73-C74","v":1.9050000000000011},0,{"$f":"(I74^2+J74^2)^0.5","v":1.9050000000000011}]
[null,null,{"$f":"C74","v":36.195},{"$f":"D74+Information!D13-2*Information!D38","v":122.55500000000001},null,{"$f":"IF($B73<>\"\",C75,0)","v":36.195},{"$f":"IF($B73<>\"\",D75,0)","v":122.55500000000001},null,0,-120.65,{"$f":"(I75^2+J75^2)^0.5","v":120.65}]
[null,null,{"$f":"C75+Information!D14","v":38.1},{"$f":"D75","v":122.55500000000001},null,{"$f":"IF($B73<>\"\",C76,0)","v":38.1},{"$f":"IF($B73<>\"\",D76,0)","v":122.55500000000001},null,-1.9050000000000011,0,{"$f":"(I76^2+J76^2)^0.5","v":1.9050000000000011}]
[null,null,{"$f":"C73","v":38.1},{"$f":"D73","v":1.905},null,{"$f":"IF($B73<>\"\",C77,0)","v":38.1},{"$f":"IF($B73<>\"\",D77,0)","v":1.905},null,0,120.65,{"$f":"(I77^2+J77^2)^0.5","v":120.65}]
[]
[null,{"$f":"IF(Information!H9=\"x\",Information!I9,\"\")","v":""},{"$f":"'Panel Calculations'!C67","v":0},{"$f":"D64","v":1.905},null,{"$f":"IF($B79<>\"\",C79,0)","v":0},{"$f":"IF($B79<>\"\",D79,0)","v":0}]
[null,null,{"$f":"C77","v":38.1},{"$f":"D77","v":1.905},null,{"$f":"IF($B79<>\"\",C80,0)","v":0},{"$f":"IF($B79<>\"\",D80,0)","v":0},null,{"$f":"C79-C80","v":-38.1},0,{"$f":"(I80^2+J80^2)^0.5","v":38.1}]
[null,null,{"$f":"C80","v":38.1},{"$f":"D76","v":122.55500000000001},null,{"$f":"IF($B79<>\"\",C81,0)","v":0},{"$f":"IF($B79<>\"\",D81,0)","v":0},null,0,-120.65,{"$f":"(I81^2+J81^2)^0.5","v":120.65}]
[null,null,{"$f":"C79","v":0},{"$f":"D81","v":122.55500000000001},null,{"$f":"IF($B79<>\"\",C82,0)","v":0},{"$f":"IF($B79<>\"\",D82,0)","v":0},null,38.1,0,{"$f":"(I82^2+J82^2)^0.5","v":38.1}]
[null,null,{"$f":"C79","v":0},{"$f":"D79","v":1.905},null,{"$f":"IF($B79<>\"\",C83,0)","v":0},{"$f":"IF($B79<>\"\",D83,0)","v":0},null,0,120.65,{"$f":"(I83^2+J83^2)^0.5","v":120.65}]
[]
[null,{"$f":"IF(Information!H10=\"x\",Information!I10,\"\")","v":"Panel F, 1st internal"},{"$f":"C64","v":0},{"$f":"D63+Information!D20","v":11.43},null,{"$f":"IF($B85<>\"\",C85,0)","v":0},{"$f":"IF($B85<>\"\",D85,0)","v":11.43}]
[null,null,{"$f":"C74-Information!D20","v":26.67},{"$f":"D85","v":11.43},null,{"$f":"IF($B85<>\"\",C86,0)","v":26.67},{"$f":"IF($B85<>\"\",D86,0)","v":11.43},null,{"$f":"C85-C86","v":-26.67},0,{"$f":"(I86^2+J86^2)^0.5","v":26.67}]
[null,null,{"$f":"C86","v":26.67},{"$f":"D86+Information!D41","v":13.334999999999999},null,{"$f":"IF($B85<>\"\",C87,0)","v":26.67},{"$f":"IF($B85<>\"\",D87,0)","v":13.334999999999999},null,0,-1.9049999999999994,{"$f":"(I87^2+J87^2)^0.5","v":1.9049999999999994}]
[null,null,{"$f":"C85","v":0},{"$f":"D87","v":13.334999999999999},null,{"$f":"IF($B85<>\"\",C88,0)","v":0},{"$f":"IF($B85<>\"\",D88,0)","v":13.334999999999999},null,26.67,0,{"$f":"(I88^2+J88^2)^0.5","v":26.67}]
[null,null,{"$f":"C85","v":0},{"$f":"D85","v":11.43},null,{"$f":"IF($B85<>\"\",C89,0)","v":0},{"$f":"IF($B85<>\"\",D89,0)","v":11.43},null,0,1.9049999999999994,{"$f":"(I89^2+J89^2)^0.5","v":1.9049999999999994}]
[]
[null,{"$f":"IF(Information!H11=\"x\",Information!I11,\"\")","v":"Panel G, 2nd internal"},{"$f":"C86","v":26.67},{"$f":"D87","v":13.334999999999999},null,{"$f":"IF($B91<>\"\",C91,0)","v":26.67},{"$f":"IF($B91<>\"\",D91,0)","v":13.334999999999999}]
[null,null,{"$f":"C91","v":26.67},{"$f":"D68-Information!D20","v":113.03},null,{"$f":"IF($B91<>\"\",C92,0)","v":26.67},{"$f":"IF($B91<>\"\",D92,0)","v":113.03},null,{"$f":"C91-C92","v":0},{"$f":"D91-D92","v":-99.695000000000007},{"$f":"(I92^2+J92^2)^0.5","v":99.695000000000007}]
[null,null,{"$f":"C92-Information!D42","v":24.765000000000001},{"$f":"D92","v":113.03},null,{"$f":"IF($B91<>\"\",C93,0)","v":24.765000000000001},{"$f":"IF($B91<>\"\",D93,0)","v":113.03},null,1.9050000000000011,0,{"$f":"(I93^2+J93^2)^0.5","v":1.9050000000000011}]
[null,null,{"$f":"C93","v":24.765000000000001},{"$f":"D91","v":13.334999999999999},null,{"$f":"IF($B91<>\"\",C94,0)","v":24.765000000000001},{"$f":"IF($B91<>\"\",D94,0)","v":13.334999999999999},null,0,99.695000000000007,{"$f":"(I94^2+J94^2)^0.5","v":99.695000000000007}]
[null,null,{"$f":"C91","v":26.67},{"$f":"D91","v":13.334999999999999},null,{"$f":"IF($B91<>\"\",C95,0)","v":26.67},{"$f":"IF($B91<>\"\",D95,0)","v":13.334999999999999},null,-1.9050000000000011,0,{"$f":"(I95^2+J95^2)^0.5","v":1.9050000000000011}]
[]
[null,{"$f":"IF(Information!H12=\"x\",Information!I12,\"\")","v":"Panel H, 2nd internal"},{"$f":"C93-Information!D20","v":15.24},{"$f":"D81","v":122.55500000000001},null,{"$f":"IF($B97<>\"\",C97,0)","v":15.24},{"$f":"IF($B97<>\"\",D97,0)","v":122.55500000000001}]
[null,null,{"$f":"C97","v":15.24},{"$f":"D87+Information!D20","v":22.86},null,{"$f":"IF($B97<>\"\",C98,0)","v":15.24},{"$f":"IF($B97<>\"\",D98,0)","v":22.86},null,{"$f":"C97-C98","v":0},{"$f":"D97-D98","v":99.695000000000007},{"$f":"(I98^2+J98^2)^0.5","v":99.695000000000007}]
[null,null,{"$f":"C98-Information!D36","v":13.335000000000001},{"$f":"D98","v":22.86},null,{"$f":"IF($B97<>\"\",C99,0)","v":13.335000000000001},{"$f":"IF($B97<>\"\",D99,0)","v":22.86},null,1.9049999999999994,0,{"$f":"(I99^2+J99^2)^0.5","v":1.9049999999999994}]
[null,null,{"$f":"C99","v":13.335000000000001},{"$f":"D97","v":122.55500000000001},null,{"$f":"IF($B97<>\"\",C100,0)","v":13.335000000000001},{"$f":"IF($B97<>\"\",D100,0)","v":122.55500000000001},null,0,-99.695000000000007,{"$f":"(I100^2+J100^2)^0.5","v":99.695000000000007}]
[null,null,{"$f":"C97","v":15.24},{"$f":"D97","v":122.55500000000001},null,{"$f":"IF($B97<>\"\",C101,0)","v":15.24},{"$f":"IF($B97<>\"\",D101,0)","v":122.55500000000001},null,-1.9049999999999994,0,{"$f":"(I101^2+J101^2)^0.5","v":1.9049999999999994}]

{"sheet":"Path Calculations","index":2,"n_rows":74,"n_cols":16,"rows_kept":74,"cut":false,"hidden":false,"merged":[]}
[]
[]
[null,null,null,null,null,null,null,null,{"$f":"I6","v":8.5724999999999998},{"$f":"J6","v":122.55500000000001}]
[null,"Path Calculations",null,"x","y",null,"x","y",null,"d","x","y","dS","d","L","s"]
[]
[null,null,null,{"$f":"'Panel Calculations'!$C$99","v":13.335000000000001},{"$f":"'Panel Calculations'!$D$67","v":122.55500000000001},null,{"$f":"IF(Information!$H$16=\"x\",D6,0)","v":13.335000000000001},{"$f":"IF(Information!$H$16=\"x\",E6,0)","v":122.55500000000001},{"$f":"SUM(D6:D7)/2","v":8.5724999999999998},{"$f":"SUM(E6:E7)/2","v":122.55500000000001},{"$f":"IF(Information!$H$15=\"x\",I6,0)","v":8.5724999999999998},{"$f":"IF(Information!$H$15=\"x\",J6,0)","v":122.55500000000001},null,{"$f":"N3","v":0},{"$f":"O21","v":0},{"$f":"P21","v":0}]
[null,null,"S1",{"$f":"'Panel Calculations'!$C$44","v":3.81},{"$f":"E6","v":122.55500000000001},null,{"$f":"IF(Information!$H$16=\"x\",D7,0)","v":3.81},{"$f":"IF(Information!$H$16=\"x\",E7,0)","v":122.55500000000001},null,null,{"$f":"K6","v":8.5724999999999998},{"$f":"L6","v":122.55500000000001},null,{"$f":"N6","v":0},{"$f":"O6","v":0},0]
[null,null,null,null,null,null,null,null,null,null,{"$f":"K7","v":8.5724999999999998},{"$f":"L7","v":122.55500000000001},null,{"$f":"((I6-I3)^2+(J6-J3)^2)^0.5","v":0},{"$f":"O5+N8","v":0},{"$f":"Information!$D$19*((D6-D7)^2+(E6-E7)^2)^0.5","v":205.64475000000002}]
[null,null,null,{"$f":"'Panel Calculations'!$C$99","v":13.335000000000001},{"$f":"'Panel Calculations'!$D$99","v":22.86},null,{"$f":"IF(Information!$H$16=\"x\",D9,0)","v":13.335000000000001},{"$f":"IF(Information!$H$16=\"x\",E9,0)","v":22.86},{"$f":"SUM(D9:D10)/2","v":8.5724999999999998},{"$f":"SUM(E9:E10)/2","v":22.86},{"$f":"IF(Information!$H$15=\"x\",I9,0)","v":8.5724999999999998},{"$f":"IF(Information!$H$15=\"x\",J9,0)","v":22.86},null,{"$f":"N6","v":0},{"$f":"O24","v":0},{"$f":"P27","v":0}]
[null,null,null,{"$f":"'Panel Calculations'!$C$44","v":3.81},{"$f":"E9","v":22.86},null,{"$f":"IF(Information!$H$16=\"x\",D10,0)","v":3.81},{"$f":"IF(Information!$H$16=\"x\",E10,0)","v":22.86},null,null,{"$f":"K9","v":8.5724999999999998},{"$f":"L9","v":22.86},null,{"$f":"N9","v":0},0,{"$f":"P9","v":0}]
[null,null,null,null,null,null,null,null,null,null,{"$f":"K10","v":8.5724999999999998},{"$f":"L10","v":22.86},null,{"$f":"((I9-I6)^2+(J9-J6)^2)^0.5","v":99.695000000000007},{"$f":"O8+N11","v":99.695000000000007},{"$f":"Information!$D$19*((D9-D10)^2+(E9-E10)^2)^0.5","v":205.64475000000002}]
[null,null,null,{"$f":"'Panel Calculations'!$C$99","v":13.335000000000001},{"$f":"'Panel Calculations'!$D$99","v":22.86},null,{"$f":"IF(Information!$H$16=\"x\",D12,0)","v":13.335000000000001},{"$f":"IF(Information!$H$16=\"x\",E12,0)","v":22.86},{"$f":"SUM(D12:D13)/2","v":8.5724999999999998},{"$f":"SUM(E12:E13)/2","v":20.478749999999998},{"$f":"IF(Information!$H$15=\"x\",I12,0)","v":8.5724999999999998},{"$f":"IF(Information!$H$15=\"x\",J12,0)","v":20.478749999999998},null,{"$f":"N9","v":0},{"$f":"O30","v":0},{"$f":"P30","v":0}]
[null,null,null,{"$f":"'Panel Calculations'!$C$44","v":3.81},{"$f":"(E15+E16)/2","v":18.0975},null,{"$f":"IF(Information!$H$16=\"x\",D13,0)","v":3.81},{"$f":"IF(Information!$H$16=\"x\",E13,0)","v":18.0975},null,null,{"$f":"K12","v":8.5724999999999998},{"$f":"L12","v":20.478749999999998},null,{"$f":"N12","v":0},{"$f":"O12","v":0},0]
[null,null,null,null,null,null,null,null,null,null,{"$f":"K13","v":8.5724999999999998},{"$f":"L13","v":20.478749999999998},null,{"$f":"((I12-I9)^2+(J12-J9)^2)^0.5","v":2.3812500000000014},{"$f":"O11+N14","v":102.07625000000002},{"$f":"Information!$D$19*((D12-D13)^2+(E12-E13)^2)^0.5","v":229.91782010797493}]
[null,null,null,{"$f":"'Panel Calculations'!$C$99","v":13.335000000000001},{"$f":"'Panel Calculations'!$D$99","v":22.86},null,{"$f":"IF(Information!$H$16=\"x\",D15,0)","v":13.335000000000001},{"$f":"IF(Information!$H$16=\"x\",E15,0)","v":22.86},{"$f":"SUM(D15:D16)/2","v":10.953749999999999},{"$f":"SUM(E15:E16)/2","v":18.0975},{"$f":"IF(Information!$H$15=\"x\",I15,0)","v":10.953749999999999},{"$f":"IF(Information!$H$15=\"x\",J15,0)","v":18.0975},null,{"$f":"N12","v":0},{"$f":"O33","v":0},{"$f":"P33","v":0}]
[null,null,null,{"$f":"(D15+'Panel Calculations'!$C$44)/2","v":8.5724999999999998},{"$f":"'Panel Calculations'!$D$87","v":13.334999999999999},null,{"$f":"IF(Information!$H$16=\"x\",D16,0)","v":8.5724999999999998},{"$f":"IF(Information!$H$16=\"x\",E16,0)","v":13.334999999999999},null,null,{"$f":"K15","v":10.953749999999999},{"$f":"L15","v":18.0975},null,{"$f":"N15","v":0},{"$f":"O15","v":0},0]
[null,null,null,null,null,null,null,null,null,null,{"$f":"K16","v":10.953749999999999},{"$f":"L16","v":18.0975},null,{"$f":"((I15-I12)^2+(J15-J12)^2)^0.5","v":3.3675960454009308},{"$f":"O14+N17","v":105.44384604540095},{"$f":"Information!$D$19*((D15-D16)^2+(E15-E16)^2)^0.5","v":229.91782010797496}]
[null,null,null,{"$f":"'Panel Calculations'!$C$99","v":13.335000000000001},{"$f":"'Panel Calculations'!$D$99","v":22.86},null,{"$f":"IF(Information!$H$16=\"x\",D18,0)","v":13.335000000000001},{"$f":"IF(Information!$H$16=\"x\",E18,0)","v":22.86},{"$f":"SUM(D18:D19)/2","v":13.335000000000001},{"$f":"SUM(E18:E19)/2","v":18.0975},{"$f":"IF(Information!$H$15=\"x\",I18,0)","v":13.335000000000001},{"$f":"IF(Information!$H$15=\"x\",J18,0)","v":18.0975},null,{"$f":"N15","v":0},{"$f":"O36","v":0},{"$f":"P36","v":0}]
[null,null,null,{"$f":"D18","v":13.335000000000001},{"$f":"'Panel Calculations'!$D$87","v":13.334999999999999},null,{"$f":"IF(Information!$H$16=\"x\",D19,0)","v":13.335000000000001},{"$f":"IF(Information!$H$16=\"x\",E19,0)","v":13.334999999999999},null,null,{"$f":"K18","v":13.335000000000001},{"$f":"L18","v":18.0975},null,{"$f":"N18","v":0},{"$f":"O18","v":0},0]
[null,null,null,null,null,null,null,null,null,null,{"$f":"K19","v":13.335000000000001},{"$f":"L19","v":18.0975},null,{"$f":"((I18-I15)^2+(J18-J15)^2)^0.5","v":2.3812500000000014},{"$f":"O17+N20","v":107.82509604540095},{"$f":"Information!$D$19*((D18-D19)^2+(E18-E19)^2)^0.5","v":205.64475000000002}]
[null,null,null,{"$f":"'Panel Calculations'!$C$98","v":15.24},{"$f":"'Panel Calculations'!$D$98","v":22.86},null,{"$f":"IF(Information!$H$16=\"x\",D21,0)","v":15.24},{"$f":"IF(Information!$H$16=\"x\",E21,0)","v":22.86},{"$f":"SUM(D21:D22)/2","v":15.24},{"$f":"SUM(E21:E22)/2","v":18.0975},{"$f":"IF(Information!$H$15=\"x\",I21,0)","v":15.24},{"$f":"IF(Information!$H$15=\"x\",J21,0)","v":18.0975},null,{"$f":"N18","v":0},{"$f":"O39","v":0},{"$f":"P39","v":0}]
[null,null,null,{"$f":"D21","v":15.24},{"$f":"'Panel Calculations'!$D$87","v":13.334999999999999},null,{"$f":"IF(Information!$H$16=\"x\",D22,0)","v":15.24},{"$f":"IF(Information!$H$16=\"x\",E22,0)","v":13.334999999999999},null,null,{"$f":"K21","v":15.24},{"$f":"L21","v":18.0975},null,{"$f":"N21","v":0},{"$f":"O21","v":0},0]
[null,null,null,null,null,null,null,null,null,null,{"$f":"K22","v":15.24},{"$f":"L22","v":18.0975},null,{"$f":"((I21-I18)^2+(J21-J18)^2)^0.5","v":1.9049999999999994},{"$f":"O20+N23","v":109.73009604540096},{"$f":"Information!$D$19*((D21-D22)^2+(E21-E22)^2)^0.5","v":205.64475000000002}]
[null,null,null,{"$f":"'Panel Calculations'!$C$98","v":15.24},{"$f":"'Panel Calculations'!$D$98","v":22.86},null,{"$f":"IF(Information!$H$16=\"x\",D24,0)","v":15.24},{"$f":"IF(Information!$H$16=\"x\",E24,0)","v":22.86},{"$f":"SUM(D24:D25)/2","v":17.62125},{"$f":"SUM(E24:E25)/2","v":18.0975},{"$f":"IF(Information!$H$15=\"x\",I24,0)","v":17.62125},{"$f":"IF(Information!$H$15=\"x\",J24,0)","v":18.0975},null,{"$f":"N21","v":0},{"$f":"O42","v":0},{"$f":"P42","v":0}]
[null,null,null,{"$f":"(D24+D28)/2","v":20.002500000000001},{"$f":"'Panel Calculations'!$D$87","v":13.334999999999999},null,{"$f":"IF(Information!$H$16=\"x\",D25,0)","v":20.002500000000001},{"$f":"IF(Information!$H$16=\"x\",E25,0)","v":13.334999999999999},null,null,{"$f":"K24","v":17.62125},{"$f":"L24","v":18.0975},null,{"$f":"N24","v":0},{"$f":"O24","v":0},0]
[null,null,null,null,null,null,null,null,null,null,{"$f":"K25","v":17.62125},{"$f":"L25","v":18.0975},null,{"$f":"((I24-I21)^2+(J24-J21)^2)^0.5","v":2.3812499999999996},{"$f":"O23+N26","v":112.11134604540095},{"$f":"Information!$D$19*((D24-D25)^2+(E24-E25)^2)^0.5","v":229.91782010797496}]
[null,null,null,{"$f":"'Panel Calculations'!$C$98","v":15.24},{"$f":"'Panel Calculations'!$D$98","v":22.86},null,{"$f":"IF(Information!$H$16=\"x\",D27,0)","v":15.24},{"$f":"IF(Information!$H$16=\"x\",E27,0)","v":22.86},{"$f":"SUM(D27:D28)/2","v":20.002500000000001},{"$f":"SUM(E27:E28)/2","v":20.478749999999998},{"$f":"IF(Information!$H$15=\"x\",I27,0)","v":20.002500000000001},{"$f":"IF(Information!$H$15=\"x\",J27,0)","v":20.478749999999998},null,{"$f":"N24","v":0},{"$f":"O45","v":0},{"$f":"P45","v":0}]
[null,null,null,{"$f":"D31","v":24.765000000000001},{"$f":"(E27+'Panel Calculations'!$D$87)/2","v":18.0975},null,{"$f":"IF(Information!$H$16=\"x\",D28,0)","v":24.765000000000001},{"$f":"IF(Information!$H$16=\"x\",E28,0)","v":18.0975},null,null,{"$f":"K27","v":20.002500000000001},{"$f":"L27","v":20.478749999999998},null,{"$f":"N27","v":0},{"$f":"O27","v":0},0]
[null,null,null,null,null,null,null,null,null,null,{"$f":"K28","v":20.002500000000001},{"$f":"L28","v":20.478749999999998},null,{"$f":"((I27-I24)^2+(J27-J24)^2)^0.5","v":3.3675960454009322},{"$f":"O26+N29","v":115.47894209080188},{"$f":"Information!$D$19*((D27-D28)^2+(E27-E28)^2)^0.5","v":229.91782010797493}]
[null,null,null,{"$f":"'Panel Calculations'!$C$98","v":15.24},{"$f":"'Panel Calculations'!$D$98","v":22.86},null,{"$f":"IF(Information!$H$16=\"x\",D30,0)","v":15.24},{"$f":"IF(Information!$H$16=\"x\",E30,0)","v":22.86},{"$f":"SUM(D30:D31)/2","v":20.002500000000001},{"$f":"SUM(E30:E31)/2","v":22.86},{"$f":"IF(Information!$H$15=\"x\",I30,0)","v":20.002500000000001},{"$f":"IF(Information!$H$15=\"x\",J30,0)","v":22.86},null,{"$f":"N27","v":0},{"$f":"O48","v":0},{"$f":"P48","v":0}]
[null,null,null,{"$f":"'Panel Calculations'!$C$94","v":24.765000000000001},{"$f":"E30","v":22.86},null,{"$f":"IF(Information!$H$16=\"x\",D31,0)","v":24.765000000000001},{"$f":"IF(Information!$H$16=\"x\",E31,0)","v":22.86},null,null,{"$f":"K30","v":20.002500000000001},{"$f":"L30","v":22.86},null,{"$f":"N30","v":0},{"$f":"O30","v":0},0]
[null,null,null,null,null,null,null,null,null,null,{"$f":"K31","v":20.002500000000001},{"$f":"L31","v":22.86},null,{"$f":"((I30-I27)^2+(J30-J27)^2)^0.5","v":2.3812500000000014},{"$f":"O29+N32","v":117.86019209080189},{"$f":"Information!$D$19*((D30-D31)^2+(E30-E31)^2)^0.5","v":205.64475000000002}]
[null,null,null,{"$f":"'Panel Calculations'!$C$93","v":24.765000000000001},{"$f":"'Panel Calculations'!$D$93","v":113.03},null,{"$f":"IF(Information!$H$16=\"x\",D33,0)","v":24.765000000000001},{"$f":"IF(Information!$H$16=\"x\",E33,0)","v":113.03},{"$f":"SUM(D33:D34)/2","v":20.002500000000001},{"$f":"SUM(E33:E34)/2","v":113.03},{"$f":"IF(Information!$H$15=\"x\",I33,0)","v":20.002500000000001},{"$f":"IF(Information!$H$15=\"x\",J33,0)","v":113.03},null,{"$f":"N30","v":0},{"$f":"O51","v":0},{"$f":"P51","v":0}]
[null,null,null,{"$f":"D37","v":15.24},{"$f":"'Panel Calculations'!$D$93","v":113.03},null,{"$f":"IF(Information!$H$16=\"x\",D34,0)","v":15.24},{"$f":"IF(Information!$H$16=\"x\",E34,0)","v":113.03},null,null,{"$f":"K33","v":20.002500000000001},{"$f":"L33","v":113.03},null,{"$f":"N33","v":0},{"$f":"O33","v":0},0]
[null,null,null,null,null,null,null,null,null,null,{"$f":"K34","v":20.002500000000001},{"$f":"L34","v":113.03},null,{"$f":"((I33-I30)^2+(J33-J30)^2)^0.5","v":90.17},{"$f":"O32+N35","v":208.0301920908019},{"$f":"Information!$D$19*((D33-D34)^2+(E33-E34)^2)^0.5","v":205.64475000000002}]
[null,null,null,{"$f":"'Panel Calculations'!$C$93","v":24.765000000000001},{"$f":"'Panel Calculations'!$D$93","v":113.03},null,{"$f":"IF(Information!$H$16=\"x\",D36,0)","v":24.765000000000001},{"$f":"IF(Information!$H$16=\"x\",E36,0)","v":113.03},{"$f":"SUM(D36:D37)/2","v":20.002500000000001},{"$f":"SUM(E36:E37)/2","v":115.41125},{"$f":"IF(Information!$H$15=\"x\",I36,0)","v":20.002500000000001},{"$f":"IF(Information!$H$15=\"x\",J36,0)","v":115.41125},null,{"$f":"N33","v":0},{"$f":"O54","v":0},{"$f":"P54","v":0}]
[null,null,null,{"$f":"'Panel Calculations'!$C$97","v":15.24},{"$f":"(E39+E40)/2","v":117.7925},null,{"$f":"IF(Information!$H$16=\"x\",D37,0)","v":15.24},{"$f":"IF(Information!$H$16=\"x\",E37,0)","v":117.7925},null,null,{"$f":"K36","v":20.002500000000001},{"$f":"L36","v":115.41125},null,{"$f":"N36","v":0},{"$f":"O36","v":0},0]
[null,null,null,null,null,null,null,null,null,null,{"$f":"K37","v":20.002500000000001},{"$f":"L37","v":115.41125},null,{"$f":"((I36-I33)^2+(J36-J33)^2)^0.5","v":2.3812499999999943},{"$f":"O35+N38","v":210.4114420908019},{"$f":"Information!$D$19*((D36-D37)^2+(E36-E37)^2)^0.5","v":229.91782010797496}]
[null,null,null,{"$f":"'Panel Calculations'!$C$93","v":24.765000000000001},{"$f":"'Panel Calculations'!$D$93","v":113.03},null,{"$f":"IF(Information!$H$16=\"x\",D39,0)","v":24.765000000000001},{"$f":"IF(Information!$H$16=\"x\",E39,0)","v":113.03},{"$f":"SUM(D39:D40)/2","v":22.383749999999999},{"$f":"SUM(E39:E40)/2","v":117.7925},{"$f":"IF(Information!$H$15=\"x\",I39,0)","v":22.383749999999999},{"$f":"IF(Information!$H$15=\"x\",J39,0)","v":117.7925},null,{"$f":"N36","v":0},{"$f":"O57","v":0},{"$f":"P57","v":0}]
[null,null,null,{"$f":"(D39+'Panel Calculations'!$C$97)/2","v":20.002500000000001},{"$f":"'Panel Calculations'!$D$68","v":122.55500000000001},null,{"$f":"IF(Information!$H$16=\"x\",D40,0)","v":20.002500000000001},{"$f":"IF(Information!$H$16=\"x\",E40,0)","v":122.55500000000001},null,null,{"$f":"K39","v":22.383749999999999},{"$f":"L39","v":117.7925},null,{"$f":"N39","v":0},{"$f":"O39","v":0},0]
[null,null,null,null,null,null,null,null,null,null,{"$f":"K40","v":22.383749999999999},{"$f":"L40","v":117.7925},null,{"$f":"((I39-I36)^2+(J39-J36)^2)^0.5","v":3.367596045400937},{"$f":"O38+N41","v":213.77903813620284},{"$f":"Information!$D$19*((D39-D40)^2+(E39-E40)^2)^0.5","v":229.91782010797505}]
[null,null,null,{"$f":"'Panel Calculations'!$C$93","v":24.765000000000001},{"$f":"'Panel Calculations'!$D$93","v":113.03},null,{"$f":"IF(Information!$H$16=\"x\",D42,0)","v":24.765000000000001},{"$f":"IF(Information!$H$16=\"x\",E42,0)","v":113.03},{"$f":"SUM(D42:D43)/2","v":24.765000000000001},{"$f":"SUM(E42:E43)/2","v":117.7925},{"$f":"IF(Information!$H$15=\"x\",I42,0)","v":24.765000000000001},{"$f":"IF(Information!$H$15=\"x\",J42,0)","v":117.7925},null,{"$f":"N39","v":0},{"$f":"O60","v":0},{"$f":"P60","v":0}]
[null,null,null,{"$f":"D42","v":24.765000000000001},{"$f":"'Panel Calculations'!$D$68","v":122.55500000000001},null,{"$f":"IF(Information!$H$16=\"x\",D43,0)","v":24.765000000000001},{"$f":"IF(Information!$H$16=\"x\",E43,0)","v":122.55500000000001},null,null,{"$f":"K42","v":24.765000000000001},{"$f":"L42","v":117.7925},null,{"$f":"N42","v":0},{"$f":"O42","v":0},0]
[null,null,null,null,null,null,null,null,null,null,{"$f":"K43","v":24.765000000000001},{"$f":"L43","v":117.7925},null,{"$f":"((I42-I39)^2+(J42-J39)^2)^0.5","v":2.3812500000000014},{"$f":"O41+N44","v":216.16028813620284},{"$f":"Information!$D$19*((D42-D43)^2+(E42-E43)^2)^0.5","v":205.64475000000013}]
[null,null,null,{"$f":"D48","v":26.67},{"$f":"E48","v":113.03},null,{"$f":"IF(Information!$H$16=\"x\",D45,0)","v":26.67},{"$f":"IF(Information!$H$16=\"x\",E45,0)","v":113.03},{"$f":"SUM(D45:D46)/2","v":26.67},{"$f":"SUM(E45:E46)/2","v":117.7925},{"$f":"IF(Information!$H$15=\"x\",I45,0)","v":26.67},{"$f":"IF(Information!$H$15=\"x\",J45,0)","v":117.7925},null,{"$f":"N42","v":0},{"$f":"O63","v":0},{"$f":"P63","v":0}]
[null,null,null,{"$f":"D45","v":26.67},{"$f":"'Panel Calculations'!$D$68","v":122.55500000000001},null,{"$f":"IF(Information!$H$16=\"x\",D46,0)","v":26.67},{"$f":"IF(Information!$H$16=\"x\",E46,0)","v":122.55500000000001},null,null,{"$f":"K45","v":26.67},{"$f":"L45","v":117.7925},null,{"$f":"N45","v":0},{"$f":"O45","v":0},0]
[null,null,null,null,null,null,null,null,null,null,{"$f":"K46","v":26.67},{"$f":"L46","v":117.7925},null,{"$f":"((I45-I42)^2+(J45-J42)^2)^0.5","v":1.9050000000000011},{"$f":"O44+N47","v":218.06528813620284},{"$f":"Information!$D$19*((D45-D46)^2+(E45-E46)^2)^0.5","v":205.64475000000013}]
[null,null,null,{"$f":"D51","v":26.67},{"$f":"E51","v":113.03},null,{"$f":"IF(Information!$H$16=\"x\",D48,0)","v":26.67},{"$f":"IF(Information!$H$16=\"x\",E48,0)","v":113.03},{"$f":"SUM(D48:D49)/2","v":26.67},{"$f":"SUM(E48:E49)/2","v":117.7925},{"$f":"IF(Information!$H$15=\"x\",I48,0)","v":26.67},{"$f":"IF(Information!$H$15=\"x\",J48,0)","v":117.7925},null,{"$f":"N45","v":0},{"$f":"O66","v":0},{"$f":"P66","v":0}]
[null,null,null,{"$f":"D48","v":26.67},{"$f":"'Panel Calculations'!$D$68","v":122.55500000000001},null,{"$f":"IF(Information!$H$16=\"x\",D49,0)","v":26.67},{"$f":"IF(Information!$H$16=\"x\",E49,0)","v":122.55500000000001},null,null,{"$f":"K48","v":26.67},{"$f":"L48","v":117.7925},null,{"$f":"N48","v":0},{"$f":"O48","v":0},0]
[null,null,null,null,null,null,null,null,null,null,{"$f":"K49","v":26.67},{"$f":"L49","v":117.7925},null,{"$f":"((I48-I45)^2+(J48-J45)^2)^0.5","v":0},{"$f":"O47+N50","v":218.06528813620284},{"$f":"Information!$D$19*((D48-D49)^2+(E48-E49)^2)^0.5","v":205.64475000000013}]
[null,null,null,{"$f":"'Panel Calculations'!$C$92","v":26.67},{"$f":"'Panel Calculations'!$D$92","v":113.03},null,{"$f":"IF(Information!$H$16=\"x\",D51,0)","v":26.67},{"$f":"IF(Information!$H$16=\"x\",E51,0)","v":113.03},{"$f":"SUM(D51:D52)/2","v":29.051250000000003},{"$f":"SUM(E51:E52)/2","v":117.7925},{"$f":"IF(Information!$H$15=\"x\",I51,0)","v":29.051250000000003},{"$f":"IF(Information!$H$15=\"x\",J51,0)","v":117.7925},null,{"$f":"N48","v":0},{"$f":"O69","v":0},{"$f":"P69","v":0}]
[null,null,null,{"$f":"(D51+D55)/2","v":31.432500000000001},{"$f":"'Panel Calculations'!$D$68","v":122.55500000000001},null,{"$f":"IF(Information!$H$16=\"x\",D52,0)","v":31.432500000000001},{"$f":"IF(Information!$H$16=\"x\",E52,0)","v":122.55500000000001},null,null,{"$f":"K51","v":29.051250000000003},{"$f":"L51","v":117.7925},null,{"$f":"N51","v":0},{"$f":"O51","v":0},0]
[null,null,null,null,null,null,null,null,null,null,{"$f":"K52","v":29.051250000000003},{"$f":"L52","v":117.7925},null,{"$f":"((I51-I48)^2+(J51-J48)^2)^0.5","v":2.3812500000000014},{"$f":"O50+N53","v":220.44653813620283},{"$f":"Information!$D$19*((D51-D52)^2+(E51-E52)^2)^0.5","v":229.91782010797505}]
[null,null,null,{"$f":"'Panel Calculations'!$C$92","v":26.67},{"$f":"'Panel Calculations'!$D$92","v":113.03},null,{"$f":"IF(Information!$H$16=\"x\",D54,0)","v":26.67},{"$f":"IF(Information!$H$16=\"x\",E54,0)","v":113.03},{"$f":"SUM(D54:D55)/2","v":31.432500000000001},{"$f":"SUM(E54:E55)/2","v":115.41125},{"$f":"IF(Information!$H$15=\"x\",I54,0)","v":31.432500000000001},{"$f":"IF(Information!$H$15=\"x\",J54,0)","v":115.41125},null,{"$f":"N51","v":0},{"$f":"O72","v":0},{"$f":"P72","v":0}]
[null,null,null,{"$f":"'Panel Calculations'!$C$75","v":36.195},{"$f":"('Panel Calculations'!D82+E54)/2","v":117.7925},null,{"$f":"IF(Information!$H$16=\"x\",D55,0)","v":36.195},{"$f":"IF(Information!$H$16=\"x\",E55,0)","v":117.7925},null,null,{"$f":"K54","v":31.432500000000001},{"$f":"L54","v":115.41125},null,{"$f":"N54","v":0},{"$f":"O54","v":0},0]
[null,null,null,null,null,null,null,null,null,null,{"$f":"K55","v":31.432500000000001},{"$f":"L55","v":115.41125},null,{"$f":"((I54-I51)^2+(J54-J51)^2)^0.5","v":3.367596045400937},{"$f":"O53+N56","v":223.81413418160378},{"$f":"Information!$D$19*((D54-D55)^2+(E54-E55)^2)^0.5","v":229.91782010797493}]
[null,null,null,{"$f":"'Panel Calculations'!C74","v":36.195},{"$f":"'Panel Calculations'!D87","v":13.334999999999999},null,{"$f":"IF(Information!$H$16=\"x\",D57,0)","v":36.195},{"$f":"IF(Information!$H$16=\"x\",E57,0)","v":13.334999999999999},{"$f":"SUM(D57:D58)/2","v":31.432500000000001},{"$f":"SUM(E57:E58)/2","v":13.334999999999999},{"$f":"IF(Information!$H$15=\"x\",I57,0)","v":31.432500000000001},{"$f":"IF(Information!$H$15=\"x\",J57,0)","v":13.334999999999999},null,{"$f":"N54","v":0},0,0]
[null,null,null,{"$f":"'Panel Calculations'!C86","v":26.67},{"$f":"E57","v":13.334999999999999},null,{"$f":"IF(Information!$H$16=\"x\",D58,0)","v":26.67},{"$f":"IF(Information!$H$16=\"x\",E58,0)","v":13.334999999999999},null,null,{"$f":"K57","v":31.432500000000001},{"$f":"L57","v":13.334999999999999},null,{"$f":"N57","v":0},{"$f":"O57","v":0},{"$f":"P57","v":0}]
[null,null,null,null,null,null,null,null,null,null,{"$f":"K58","v":31.432500000000001},{"$f":"L58","v":13.334999999999999},null,{"$f":"((I57-I54)^2+(J57-J54)^2)^0.5","v":102.07625},{"$f":"O56+N59","v":325.89038418160379},{"$f":"Information!$D$19*((D57-D58)^2+(E57-E58)^2)^0.5","v":205.64474999999996}]
[null,null,null,{"$f":"'Panel Calculations'!C74","v":36.195},{"$f":"'Panel Calculations'!D86","v":11.43},null,{"$f":"IF(Information!$H$16=\"x\",D60,0)","v":36.195},{"$f":"IF(Information!$H$16=\"x\",E60,0)","v":11.43},{"$f":"SUM(D60:D61)/2","v":31.432500000000001},{"$f":"SUM(E60:E61)/2","v":11.43},{"$f":"IF(Information!$H$15=\"x\",I60,0)","v":31.432500000000001},{"$f":"IF(Information!$H$15=\"x\",J60,0)","v":11.43},null,{"$f":"N57","v":0},{"$f":"O57","v":0},{"$f":"P57","v":0}]
[null,null,null,{"$f":"D58","v":26.67},{"$f":"E60","v":11.43},null,{"$f":"IF(Information!$H$16=\"x\",D61,0)","v":26.67},{"$f":"IF(Information!$H$16=\"x\",E61,0)","v":11.43},null,null,{"$f":"K60","v":31.432500000000001},{"$f":"L60","v":11.43},null,{"$f":"N60","v":0},{"$f":"O60","v":0},{"$f":"P60","v":0}]
[null,null,null,null,null,null,null,null,null,null,{"$f":"K61","v":31.432500000000001},{"$f":"L61","v":11.43},null,{"$f":"((I60-I57)^2+(J60-J57)^2)^0.5","v":1.9049999999999994},{"$f":"O59+N62","v":327.79538418160377},{"$f":"Information!$D$19*((D60-D61)^2+(E60-E61)^2)^0.5","v":205.64474999999996}]
[null,null,null,{"$f":"D60","v":36.195},{"$f":"(E61+'Panel Calculations'!D74)/2","v":6.6674999999999995},null,{"$f":"IF(Information!$H$16=\"x\",D63,0)","v":36.195},{"$f":"IF(Information!$H$16=\"x\",E63,0)","v":6.6674999999999995},{"$f":"SUM(D63:D64)/2","v":31.432500000000001},{"$f":"SUM(E63:E64)/2","v":9.0487500000000001},{"$f":"IF(Information!$H$15=\"x\",I63,0)","v":31.432500000000001},{"$f":"IF(Information!$H$15=\"x\",J63,0)","v":9.0487500000000001},null,{"$f":"N60","v":0},{"$f":"O60","v":0},{"$f":"P60","v":0}]
[null,null,null,{"$f":"D61","v":26.67},{"$f":"E67","v":11.43},null,{"$f":"IF(Information!$H$16=\"x\",D64,0)","v":26.67},{"$f":"IF(Information!$H$16=\"x\",E64,0)","v":11.43},null,null,{"$f":"K63","v":31.432500000000001},{"$f":"L63","v":9.0487500000000001},null,{"$f":"N63","v":0},{"$f":"O63","v":0},{"$f":"P63","v":0}]
[null,null,null,null,null,null,null,null,null,null,{"$f":"K64","v":31.432500000000001},{"$f":"L64","v":9.0487500000000001},null,{"$f":"((I63-I60)^2+(J63-J60)^2)^0.5","v":2.3812499999999996},{"$f":"O62+N65","v":330.17663418160379},{"$f":"Information!$D$19*((D63-D64)^2+(E63-E64)^2)^0.5","v":229.91782010797493}]
[null,null,null,{"$f":"(D67+'Panel Calculations'!C74)/2","v":31.432500000000001},{"$f":"'Panel Calculations'!D74","v":1.905},null,{"$f":"IF(Information!$H$16=\"x\",D66,0)","v":31.432500000000001},{"$f":"IF(Information!$H$16=\"x\",E66,0)","v":1.905},{"$f":"SUM(D66:D67)/2","v":29.051250000000003},{"$f":"SUM(E66:E67)/2","v":6.6674999999999995},{"$f":"IF(Information!$H$15=\"x\",I66,0)","v":29.051250000000003},{"$f":"IF(Information!$H$15=\"x\",J66,0)","v":6.6674999999999995},null,{"$f":"N63","v":0},{"$f":"O63","v":0},{"$f":"P63","v":0}]
[null,null,null,{"$f":"D64","v":26.67},{"$f":"E70","v":11.43},null,{"$f":"IF(Information!$H$16=\"x\",D67,0)","v":26.67},{"$f":"IF(Information!$H$16=\"x\",E67,0)","v":11.43},null,null,{"$f":"K66","v":29.051250000000003},{"$f":"L66","v":6.6674999999999995},null,{"$f":"N66","v":0},{"$f":"O66","v":0},{"$f":"P66","v":0}]
[null,null,null,null,null,null,null,null,null,null,{"$f":"K67","v":29.051250000000003},{"$f":"L67","v":6.6674999999999995},null,{"$f":"((I66-I63)^2+(J66-J63)^2)^0.5","v":3.3675960454009313},{"$f":"O65+N68","v":333.54423022700473},{"$f":"Information!$D$19*((D66-D67)^2+(E66-E67)^2)^0.5","v":229.91782010797493}]
[null,null,null,{"$f":"D70","v":26.67},{"$f":"'Panel Calculations'!D77","v":1.905},null,{"$f":"IF(Information!$H$16=\"x\",D69,0)","v":26.67},{"$f":"IF(Information!$H$16=\"x\",E69,0)","v":1.905},{"$f":"SUM(D69:D70)/2","v":26.67},{"$f":"SUM(E69:E70)/2","v":6.6674999999999995},{"$f":"IF(Information!$H$15=\"x\",I69,0)","v":26.67},{"$f":"IF(Information!$H$15=\"x\",J69,0)","v":6.6674999999999995},null,{"$f":"N66","v":0},{"$f":"O66","v":0},{"$f":"P66","v":0}]
[null,null,null,{"$f":"D67","v":26.67},{"$f":"E73","v":11.43},null,{"$f":"IF(Information!$H$16=\"x\",D70,0)","v":26.67},{"$f":"IF(Information!$H$16=\"x\",E70,0)","v":11.43},null,null,{"$f":"K69","v":26.67},{"$f":"L69","v":6.6674999999999995},null,{"$f":"N69","v":0},{"$f":"O69","v":0},{"$f":"P69","v":0}]
[null,null,null,null,null,null,null,null,null,null,{"$f":"K70","v":26.67},{"$f":"L70","v":6.6674999999999995},null,{"$f":"((I69-I66)^2+(J69-J66)^2)^0.5","v":2.3812500000000014},{"$f":"O68+N71","v":335.92548022700475},{"$f":"Information!$D$19*((D69-D70)^2+(E69-E70)^2)^0.5","v":205.64475000000002}]
[null,null,null,{"$f":"D73","v":0},{"$f":"'Panel Calculations'!D64","v":1.905},null,{"$f":"IF(Information!$H$16=\"x\",D72,0)","v":0},{"$f":"IF(Information!$H$16=\"x\",E72,0)","v":1.905},{"$f":"SUM(D72:D73)/2","v":0},{"$f":"SUM(E72:E73)/2","v":6.6674999999999995},{"$f":"IF(Information!$H$15=\"x\",I72,0)","v":0},{"$f":"IF(Information!$H$15=\"x\",J72,0)","v":6.6674999999999995},null,{"$f":"N69","v":0},{"$f":"O69","v":0},{"$f":"P69","v":0}]
[null,null,"S3",{"$f":"'Panel Calculations'!C71","v":0},{"$f":"'Panel Calculations'!D85","v":11.43},null,{"$f":"IF(Information!$H$16=\"x\",D73,0)","v":0},{"$f":"IF(Information!$H$16=\"x\",E73,0)","v":11.43},null,null,{"$f":"K72","v":0},{"$f":"L72","v":6.6674999999999995},null,{"$f":"N72","v":0},0,{"$f":"P72","v":0}]
[null,null,null,null,null,null,null,null,null,null,{"$f":"K73","v":0},{"$f":"L73","v":6.6674999999999995},null,{"$f":"((I72-I69)^2+(J72-J69)^2)^0.5","v":26.67},{"$f":"O71+N74","v":362.59548022700477},{"$f":"Information!$D$19*((D72-D73)^2+(E72-E73)^2)^0.5","v":205.64475000000002}]