{"text_format":"1","workbook":"xlsx","n_sheets":7,"sheets":["Driver","Design","Build","Hornresp","Panels","Path","Guides"],"not_rendered":{"charts":4,"images":0,"macros":1,"external_links":0,"defined_names":104,"comments":0,"pivot_tables":0},"unopened":[],"bounds":{"document_bytes":16777216,"sheet_cells":100000,"rows_first":2000,"rows_last":500,"rows_between":2000,"halvings":0,"cell_chars":16384,"cell_head_chars":4096},"cells_cut":0,"cells_raw":0,"read":"whole","date_system":"1900"}

{"sheet":"Driver","index":0,"n_rows":79,"n_cols":6,"rows_kept":79,"cut":false,"hidden":false,"merged":[[7,2,7,10],[8,2,8,10]]}
["BOXPLAN-MLTL","=","2.3 BETA"]
[]
[]
[]
[]
[]
["Driver Information"]
["Name","=","Eminence NSW6021-6"]
["Database Location","=","I:\\Users\\Brian.Steele\\OneDrive\\Hornresp\\Drivers\\"]
[]
["Size"]
["Est. Nominal Size","=",21,"in"]
[]
["Driver Parameters"]
["Sd","=",1642,"cm^2"]
["Re","=",3.8,"Ohms"]
["Fs","=",28.999782110299101,"Hz"]
["Vas","=",223.587488192,"l"]
["Qes","=",0.31000769238074993]
["Qms","=",15.355399769303663]
["Qts","=",{"$f":"(Driver_Qms*Driver_Qes)/(Driver_Qms+Driver_Qes)","v":0.30387285231544692}]
["Le","=",1.38,"mH"]
["Pmax","=",1200,"W"]
["Xmax","=",38,"mm"]
[]
["Semi-Inductance"]
["Re'","=",4.12,"Ohms"]
["Leb","=",1.55,"mH"]
["Le","=",19.170000000000002,"mH"]
["Ke","=",0.08,"sH"]
["Rss","=",24.31,"Ohms"]
[]
["Driver Dimensions"]
["Frame Width","=",{"$f":"21.65*2.54","v":54.991},"cm",{"$f":"C34/2.54","v":21.65},"in."]
["Mounting Width","=",{"$f":"19.83*2.54","v":50.368199999999995},"cm",{"$f":"C35/2.54","v":19.829999999999998},"in."]
["Mounting Depth","=",{"$f":"10.39*2.54","v":26.390600000000003},"cm",{"$f":"C36/2.54","v":10.39},"in."]
["Magnet Width","=",15,"cm",{"$f":"C37/2.54","v":5.9055118110236222},"in."]
["Magnet Height","=",12,"cm",{"$f":"C38/2.54","v":4.7244094488188972},"in."]
["Cone Volume","=",5,"l"]
[]
[]
["Merit Calculations"]
["BL^2/Re","=",54.571953727506433]
["FOM1","=",{"$f":"ROUND(Driver_Fs / Driver_Qts, 1)","v":95.4}]
["FOM2","=",{"$f":"ROUND(Driver_Vas * Driver_Fs ^ 2 / 1000, 1)","v":188}]
[]
[]
["HornResp"]
[{"$f":"Driver_Name","v":"Eminence NSW6021-6"}]
[]
[{"$f":"CONCATENATE(\"Sd=\",numSD)","v":"Sd=1642"}]
[{"$f":"CONCATENATE(\"Bl=\",numBL)","v":"Bl=34.06"}]
[{"$f":"CONCATENATE(\"Cms=\",ROUND(numCms,6))","v":"Cms=0.000058"}]
[{"$f":"CONCATENATE(\"Rms=\",numRms)","v":"Rms=6.16"}]
[{"$f":"CONCATENATE(\"Mmd=\",numMmd)","v":"Mmd=481.05"}]
[{"$f":"CONCATENATE(\"Le=\",numLe)","v":"Le=1.38"}]
[{"$f":"CONCATENATE(\"Re=\",numRe)","v":"Re=3.8"}]
[{"$f":"CONCATENATE(\"Pmax=\",numPmax)","v":"Pmax=1200"}]
[{"$f":"CONCATENATE(\"Xmax=\",numXmax)","v":"Xmax=38"}]
[{"$f":"CONCATENATE(\"Re'=\",numRe1)","v":"Re'=4.12"}]
[{"$f":"CONCATENATE(\"Leb=\",numLeb)","v":"Leb=1.55"}]
[{"$f":"CONCATENATE(\"Le=\",numLe1)","v":"Le=19.17"}]
[{"$f":"CONCATENATE(\"Ke=\",numKe)","v":"Ke=0.08"}]
[{"$f":"CONCATENATE(\"Rss=\",numRss)","v":"Rss=24.31"}]
[{"$f":"CONCATENATE(\"Rms=\",numRms1)","v":"Rms=0"}]
[{"$f":"CONCATENATE(\"Ams=\",numAms)","v":"Ams=0"}]
["LossyLe=0"]
[{"$f":"IF(numRe1>0,\"SemiInductance=1\",\"SemiInductance=1\")","v":"SemiInductance=1"}]
[{"$f":"IF(numAms>0,\"Damping=1\",\"Damping=0\")","v":"Damping=0"}]
[]
["Additional Data"]
[{"$f":"CONCATENATE(\"Driver=\",Driver_Name)","v":"Driver=Eminence NSW6021-6"}]
[{"$f":"CONCATENATE(\"FrameW=\",Driver_FrameW)","v":"FrameW=54.991"}]
[{"$f":"CONCATENATE(\"MountingW=\",Driver_MountingW)","v":"MountingW=50.3682"}]
[{"$f":"CONCATENATE(\"MountingD=\",Driver_RearMountingD)","v":"MountingD=26.3906"}]
[{"$f":"CONCATENATE(\"MagnetW=\",Driver_MagnetW)","v":"MagnetW=15"}]
[{"$f":"CONCATENATE(\"MagnetH=\",Driver_MagnetH)","v":"MagnetH=12"}]
[{"$f":"CONCATENATE(\"ConeVol=\",Driver_Conevol)","v":"ConeVol=5"}]
[{"$f":"CONCATENATE(\"FrontMountVol=\",Driver_FrontMountVol)","v":"FrontMountVol="}]

{"sheet":"Design","index":1,"n_rows":45,"n_cols":14,"rows_kept":45,"cut":false,"hidden":false,"merged":[[11,10,11,12],[9,10,9,12],[6,10,6,12],[4,10,4,12],[5,10,5,12],[7,10,7,12],[8,10,8,12]]}
[null,{"$f":"Driver!A1","v":"BOXPLAN-MLTL"},"=",{"$f":"Driver!C1","v":"2.3 BETA"}]
[]
[null,"Box Dimensions"]
[null,"Driver Frame","=",{"$f":"Driver_FrameW","v":54.991},"cm",{"$f":"D4/2.54","v":21.65},"in",null,"-",null,"Plot",null,null,"-"]
[null,"Depth (external)","=",{"$f":"28*2.54","v":71.12},"cm",28,"in",null,null,"x",{"$f":"CONCATENATE(Panels!B38,\" \",Panels!C38)","v":"Panel A (baffle)"}]
[null,"Height (external)","=",{"$f":"32*2.54","v":81.28},"cm",32,"in",null,null,"x",{"$f":"CONCATENATE(Panels!B44,\" \",Panels!C44)","v":"Panel B (top)"}]
[null,"Width (external)","=",60,"cm",23.622047244094489,"in",null,null,"x",{"$f":"CONCATENATE(Panels!B50,\" \",Panels!C50)","v":"Panel C (bottom)"}]
[null,"Panel Thickness","=",1.9,"cm",0.74803149606299213,"in",null,null,"x",{"$f":"CONCATENATE(Panels!B56,\" \",Panels!C56)","v":"Panel D (back)"}]
[null,"Panel E (1st Inside)","=",37.487797756548645,"cm",14.75897549470419,"in",{"$f":"Path!S25","v":1.0985102912854927E-3},null,"x",{"$f":"CONCATENATE(Panels!B62,\" \",Panels!C62)","v":"Panel E (1st inside)"}]
[null,"Panel E (offset)","=",-0.62947482774667252,"cm",-0.24782473533333563,"in",{"$f":"Path!S37","v":-5.6353087529714685E-8},null,"x",{"$f":"CONCATENATE(Panels!B68,\" \",Panels!C68)","v":"Panel F (2nd inside)"}]
[null,null,null,null,null,null,null,null,null,"x",{"$f":"CONCATENATE(Panels!B74,\" \",Panels!C74)","v":"Panel G (sides)"}]
[null,"Baffle Offset","=",1.9,"cm",{"$f":"D12/2.54","v":0.74803149606299213},"in",null,null,"x",{"$f":"CONCATENATE(Panels!B80,\" \",Panels!C80)","v":"Panel H (port separator)"}]
[null,"Driver Offset","=",6,"cm",{"$f":"D13/2.54","v":2.3622047244094486},"in"]
[null,null,null,null,null,null,null,null,null,"x","Profile View"]
[null,"Source Voltage","=",160,"V"]
[null,"Series Impedance","=",0.1,"Ohms",null,null,null,null,null,"Plot"]
[null,"Power Level","=",{"$f":"sim_Eg^2/Driver_Re","v":6736.8421052631584},"Watts",null,null,null,null,"x","Advanced Centerline"]
[null,null,null,null,null,null,null,null,null,"x","Sample points"]
[null,null,null,null,null,null,null,null,null,"x","Guide lines"]
[null,"Baffle Width","=",{"$f":"Box_Width-2*p","v":56.2},"cm",{"$f":"D20/2.54","v":22.125984251968504},"in",null,null,"x","Driver"]
[]
[null,"HornResp Params"]
[null,"S1","=",{"$f":"ROUND(Path!P7,0)","v":2505},"cm^2",1179]
[null,"S2","=",{"$f":"ROUND(Path!P65,0)","v":1701},"cm^2",814]
[null,"S3","=",{"$f":"ROUND(Path!P46,0)","v":800},"cm^2",450]
[null,"S4","=",800,"cm^2",450]
[null,"L12","=",{"$f":"ROUND(Path!O65,1)","v":58.4},"cm",52.7]
[null,"L23","=",{"$f":"ROUND(Path!O46-Design!D27,1)","v":65.5},"cm",52.7]
[null,"L34","=",{"$f":"ROUND(Path!O61-Design!D28-Design!D27,1)","v":69.2},"cm",59.5]
[null,"L (actual)","=",{"$f":"SUM(D27:D29)","v":193.10000000000002},"cm",{"$f":"SUM(F27:F29)","v":164.9}]
[]
[null,"Expansion","=",13.958610825819848,null,null,null,{"$f":"Path!S34","v":4.231987533330539E-3}]
[null,"Path","=",{"$f":"ROUND(Driver_Center_Y-Vent_Center_Y,1)","v":40.1},"cm"]
[]
[]
[]
[]
[]
[]
[]
[]
[]
[null,"Export Filename","=","I:\\Users\\Brian.Steele\\OneDrive\\Hornresp\\Import\\BOXPLAN.TXT"]
[null,"Comment","=",{"$f":"CONCATENATE(Driver!A1,\" \",Driver!C1,\" - \",TEXT(NOW(),\"yyyy-mm-dd hh:mm:ss\"))","v":"BOXPLAN-MLTL 2.3 BETA - 2020-04-19 13:04:28"}]
[null,"Export Format","="]

{"sheet":"Build","index":2,"n_rows":19,"n_cols":9,"rows_kept":19,"cut":false,"hidden":false,"merged":[]}
["Panel Dimensions"]
["Vol. (net)","=",{"$f":"C3-H19","v":273.56890789507696},"l.",{"$f":"(C2*1000/2.54^3)/1728","v":9.6609948076762517},"cu.ft."]
["Vol. (gross)","=",{"$f":"Box_Height*Box_Width*Box_Depth/1000","v":346.83801600000004},"l.",{"$f":"C3*0.0353","v":12.243381964800001},"cu.ft."]
[]
["Expansion","=",{"$f":"Expansion","v":13.958610825819848}]
[]
["Panels",null,"p","x","y","Goals","#","v"]
[{"$f":"Design!K5","v":"Panel A (baffle)"},null,{"$f":"p","v":1.9},{"$f":"Design!D20","v":56.2},{"$f":"Panels!L39","v":60.847034990791897},null,1,{"$f":"E8*D8*C8*G8/10^3","v":6.4972463963167595}]
[{"$f":"Design!K6","v":"Panel B (top)"},null,{"$f":"p","v":1.9},{"$f":"Design!D20","v":56.2},{"$f":"Panels!L45","v":71.12},null,1,{"$f":"E9*D9*C9*G9/10^3","v":7.5941936000000005}]
[{"$f":"Design!K7","v":"Panel C (bottom)"},null,{"$f":"p","v":1.9},{"$f":"Design!D20","v":56.2},{"$f":"Panels!L51","v":71.12},null,1,{"$f":"E10*D10*C10*G10/10^3","v":7.5941936000000005}]
[{"$f":"Design!K8","v":"Panel D (back)"},null,{"$f":"p","v":1.9},{"$f":"Design!D20","v":56.2},{"$f":"Panels!L58","v":77.47999999999999},null,1,{"$f":"E11*D11*C11*G11/10^3","v":8.2733143999999967}]
[{"$f":"Design!K9","v":"Panel E (1st inside)"},null,{"$f":"p","v":1.9},{"$f":"Design!D20","v":56.2},{"$f":"Panel_E","v":37.487797756548645},null,1,{"$f":"E12*D12*C12*G12/10^3","v":4.0029470444442641}]
[]
[{"$f":"Design!K10","v":"Panel F (2nd inside)"},null,{"$f":"p","v":1.9},{"$f":"Design!D20","v":56.2},{"$f":"Panels!L69","v":54.985124555160141},null,1,{"$f":"E14*D14*C14*G14/10^3","v":5.8713116000000003}]
[{"$f":"Design!K11","v":"Panel G (sides)"},null,{"$f":"p","v":1.9},{"$f":"Panels!L75","v":71.12},{"$f":"Panels!L78","v":81.28},null,2,{"$f":"E15*D15*C15*G15/10^3","v":21.96640768}]
[{"$f":"Design!K12","v":"Panel H (port separator)"},null,{"$f":"p","v":1.9},{"$f":"Panels!L81","v":69.22},{"$f":"Panels!L82","v":14.732965009208103},null,2,{"$f":"E16*D16*C16*G16/10^3","v":3.8753001841620627}]
["Baffle Offset",null,{"$f":"p","v":1.9},{"$f":"Design!D20","v":56.2},{"$f":"E9","v":71.12},null,1,{"$f":"E17*D17*C17*G17/10^3","v":7.5941936000000005}]
[]
[null,null,null,null,null,null,"Pnl Vol",{"$f":"SUM(H8:H18)","v":73.269108104923077},"l"]

{"sheet":"Hornresp","index":3,"n_rows":74,"n_cols":5,"rows_kept":74,"cut":false,"hidden":true,"merged":[]}
["48.20",null,2]
["BOXPLAN"]
[]
[]
["ID","=",{"$f":"INDEX(A1:A2,C1)","v":"BOXPLAN"},null,{"$f":"IF(D5=\"x\",\"\",CONCATENATE(A5,B5,C5))","v":"ID=BOXPLAN"}]
["Ang","=","2.0 x Pi",null,"Ang=2.0 x Pi"]
["Eg","=",{"$f":"sim_Eg","v":160},null,"Eg=160"]
["Rg","=",{"$f":"sim_Rg","v":0.1},null,"Rg=0.1"]
["Fta","=",0,null,"Fta=0"]
["S1","=",{"$f":"ROUND(sim_S1,1)","v":2505},null,"S1=2505"]
["S2","=",{"$f":"ROUND(sim_S2,1)","v":1701},null,"S2=1701"]
["Par","=",{"$f":"ROUND(sim_L12,1)","v":58.4},null,"Par=58.4"]
["F12","=",0,null,"F12=0"]
["S2","=",{"$f":"C11","v":1701},null,"S2=1701"]
["S3","=",{"$f":"ROUND(sim_S3,1)","v":800},null,"S3=800"]
["Par","=",{"$f":"ROUND(sim_L23,1)","v":65.5},null,"Par=65.5"]
["F23","=",0,null,"F23=0"]
["S3","=",{"$f":"C15","v":800},null,"S3=800"]
["S4","=",{"$f":"ROUND(sim_S4,1)","v":800},null,"S4=800"]
["Par","=",{"$f":"ROUND(sim_L34,1)","v":69.2},null,"Par=69.2"]
["F34","=",0,null,"F34=0"]
["S4","=",0,null,"S4=0"]
["S5","=",0,null,"S5=0"]
["L45","=",0,null,"L45=0"]
["F45","=",0,null,"F45=0"]
["Sd","=",{"$f":"Driver_Sd","v":1642},null,"Sd=1642"]
["Bl","=",{"$f":"ROUND((Driver_Re/(Driver_Qes*numCms*2*PI()*Driver_Fs))^0.5,2)","v":34.06},null,"Bl=34.06"]
["Cms","=",{"$f":"ROUND(Driver_Vas/(1.42*Driver_Sd^2),6)","v":5.8E-5},null,"Cms=0.000058"]
["Rms","=",{"$f":"ROUND(1/(2*PI()*Driver_Fs*numCms*Driver_Qms),2)","v":6.16},null,"Rms=6.16"]
["Mmd","=",{"$f":"ROUND(1000/((2*PI()*Driver_Fs)^2*numCms)-(0.575*Driver_Sd^1.5/1000),2)","v":481.05},null,"Mmd=481.05"]
["Le","=",{"$f":"Driver_Le","v":1.38},null,"Le=1.38"]
["Re","=",{"$f":"Driver_Re","v":3.8},null,"Re=3.8"]
["OD","=",1,null,"OD=1"]
["Vrc","=",0,null,"Vrc=0"]
["Lrc","=",0,null,"Lrc=0"]
["Ap1","=",0,null,"Ap1=0"]
["Lp","=",0,null,"Lp=0"]
["Vtc","=",0,null,"Vtc=0"]
["Atc","=",0,null,"Atc=0"]
["Pmax","=",{"$f":"Driver_Pmax","v":1200},null,"Pmax=1200"]
["Xmax","=",{"$f":"Driver_Xmax","v":38},null,"Xmax=38"]
["Path","=",{"$f":"Path","v":40.1},null,"Path=40.1"]
["Mass","=",0,null,"Mass=0"]
["Re'","=",{"$f":"Driver_Re1","v":4.12},null,"Re'=4.12"]
["Leb","=",{"$f":"Driver_Leb","v":1.55},null,"Leb=1.55"]
["Le","=",{"$f":"Driver_Le1","v":19.170000000000002},null,"Le=19.17"]
["Ke","=",{"$f":"Driver_Ke","v":0.08},null,"Ke=0.08"]
["Rss","=",{"$f":"Driver_Rss","v":24.31},null,"Rss=24.31"]
["Rms","=",0,null,"Rms=0"]
["Ams","=",0,null,"Ams=0"]
[null,null,"Fr1=0.00",{"$f":"IF($C$5=\"BOXPLAN\",\"x\",\"\")","v":"x"},""]
[null,null,"Fr2=0.00","x",""]
[null,null,"Fr3=0.00","x",""]
[null,null,"Fr4=0.00","x",""]
[null,null,"Tal1=100","x",""]
[null,null,"Tal2=100","x",""]
[null,null,"Tal3=100","x",""]
[null,null,"Tal4=100","x",""]
["Comment","=",{"$f":"sim_Comment","v":"BOXPLAN-MLTL 2.3 BETA - 2020-04-19 13:04:28"},null,"Comment=BOXPLAN-MLTL 2.3 BETA - 2020-04-19 13:04:28"]
[null,null,"~~~~~~~~~~~~~~~~~~~~~~~~~~~~~~~~~~~~~~~~~~~~~~~~~~~~~~~~~~~~~~~~~~~~~~~~~~~~~~~~~~~~",{"$f":"IF($C$5=\"BOXPLAN\",\"x\",\"\")","v":"x"},""]
[null,null,"FILTER","x",""]
[null,null,"      0   0.01    0.0     -1      0   0.01    0.0     -1      0   0.01    0.0     -1","x",""]
[null,null,"      0   0.01    0.0     -1      0   0.01    0.0     -1      0   0.01    0.0     -1","x",""]
[null,null,"    0    0    0    0","x",""]
[null,null,"  1  30.50.5","x",""]
[null,null,"0.50.50.50.5","x",""]
[null,null,"SSSS","x",""]
[null,null,"0111","x",""]
[null,null,"1111","x",{"$f":"IF(D69=\"x\",\"\",CONCATENATE(A69,B69,C69))","v":""}]
[null,null,"0022",{"$f":"IF($C$5=\"BOXPLAN\",\"x\",\"\")","v":"x"},""]
[null,null,"1111",{"$f":"IF($C$5=\"BOXPLAN\",\"x\",\"\")","v":"x"},""]
[null,null,"111 ",{"$f":"IF($C$5=\"BOXPLAN\",\"x\",\"\")","v":"x"},""]
[null,null,"000",{"$f":"IF($C$5=\"BOXPLAN\",\"x\",\"\")","v":"x"},""]
[null,null,"~~~~~~~~~~~~~~~~~~~~~~~~~~~~~~~~~~~~~~~~~~~~~~~~~~~~~~~~~~~~~~~~~~~~~~~~~~~~~~~~~~~~",{"$f":"IF($C$5=\"BOXPLAN\",\"x\",\"\")","v":"x"},""]

{"sheet":"Panels","index":4,"n_rows":128,"n_cols":18,"rows_kept":128,"cut":false,"hidden":true,"merged":[]}
[]
[null,"Offset",null,"x","y"]
[null,null,null,0,0]
[]
[null,"Driver",null,"x","y"]
[null,null,null,{"$f":"D38","v":1.9},{"$f":"Path!J23-Driver_FrameW/2+Driver_Offset","v":21.920239856662612},null,{"$f":"IF(Design!$J$20=\"x\",Panels!D6,\"\")","v":1.9},{"$f":"IF(Design!$J$20=\"x\",Panels!E6,\"\")","v":21.920239856662612}]
[null,null,null,{"$f":"D6","v":1.9},{"$f":"E6+Driver_FrameW","v":76.911239856662604},null,{"$f":"IF(Design!$J$20=\"x\",Panels!D7,\"\")","v":1.9},{"$f":"IF(Design!$J$20=\"x\",Panels!E7,\"\")","v":76.911239856662604}]
[null,null,null,{"$f":"D7","v":1.9},{"$f":"E7-(Driver_FrameW-Driver_MountingW)/2","v":74.599839856662598},null,{"$f":"IF(Design!$J$20=\"x\",Panels!D8,\"\")","v":1.9},{"$f":"IF(Design!$J$20=\"x\",Panels!E8,\"\")","v":74.599839856662598}]
[null,null,null,{"$f":"D8+Driver_RearMountingD-Driver_MagnetH","v":16.290600000000001},{"$f":"E8-(Driver_MountingW-Driver_MagnetW)/2","v":56.915739856662597},null,{"$f":"IF(Design!$J$20=\"x\",Panels!D9,\"\")","v":16.290600000000001},{"$f":"IF(Design!$J$20=\"x\",Panels!E9,\"\")","v":56.915739856662597}]
[null,null,null,{"$f":"D9+Driver_MagnetH","v":28.290600000000001},{"$f":"E9","v":56.915739856662597},null,{"$f":"IF(Design!$J$20=\"x\",Panels!D10,\"\")","v":28.290600000000001},{"$f":"IF(Design!$J$20=\"x\",Panels!E10,\"\")","v":56.915739856662597}]
[null,null,null,{"$f":"D10","v":28.290600000000001},{"$f":"E10-Driver_MagnetW","v":41.915739856662597},null,{"$f":"IF(Design!$J$20=\"x\",Panels!D11,\"\")","v":28.290600000000001},{"$f":"IF(Design!$J$20=\"x\",Panels!E11,\"\")","v":41.915739856662597}]
[null,null,null,{"$f":"D9","v":16.290600000000001},{"$f":"E11","v":41.915739856662597},null,{"$f":"IF(Design!$J$20=\"x\",Panels!D12,\"\")","v":16.290600000000001},{"$f":"IF(Design!$J$20=\"x\",Panels!E12,\"\")","v":41.915739856662597}]
[null,null,null,{"$f":"D8","v":1.9},{"$f":"E6+(Driver_FrameW-Driver_MountingW)/2","v":24.231639856662614},null,{"$f":"IF(Design!$J$20=\"x\",Panels!D13,\"\")","v":1.9},{"$f":"IF(Design!$J$20=\"x\",Panels!E13,\"\")","v":24.231639856662614}]
[null,null,null,{"$f":"D13","v":1.9},{"$f":"E6+Driver_FrameW/2","v":49.415739856662611},null,{"$f":"IF(Design!$J$20=\"x\",Panels!D14,\"\")","v":1.9},{"$f":"IF(Design!$J$20=\"x\",Panels!E14,\"\")","v":49.415739856662611}]
[null,null,null,{"$f":"D12","v":16.290600000000001},{"$f":"E14","v":49.415739856662611},null,{"$f":"IF(Design!$J$20=\"x\",Panels!D15,\"\")","v":16.290600000000001},{"$f":"IF(Design!$J$20=\"x\",Panels!E15,\"\")","v":49.415739856662611}]
[null,null,null,{"$f":"D15","v":16.290600000000001},{"$f":"E12","v":41.915739856662597},null,{"$f":"IF(Design!$J$20=\"x\",Panels!D16,\"\")","v":16.290600000000001},{"$f":"IF(Design!$J$20=\"x\",Panels!E16,\"\")","v":41.915739856662597}]
[null,null,null,{"$f":"D16","v":16.290600000000001},{"$f":"E10","v":56.915739856662597},null,{"$f":"IF(Design!$J$20=\"x\",Panels!D17,\"\")","v":16.290600000000001},{"$f":"IF(Design!$J$20=\"x\",Panels!E17,\"\")","v":56.915739856662597}]
[]
[null,"Driver Axes",null,0,0]
[null,null,null,0,{"$f":"MAX(E6:E17)","v":76.911239856662604}]
[]
[null,null,null,0,0]
[null,null,null,{"$f":"E20","v":76.911239856662604},0]
[]
[]
[null,"Axes",null,0,0]
[null,null,null,0,{"$f":"MAX(D32:E131)","v":141.12}]
[null,null,null,null,null,null,null,null,null,null,null,null,null,null,"Expansion","Cos","Sin","Tan"]
[null,null,null,{"$f":"D26","v":0},{"$f":"E26","v":0},null,null,null,null,null,null,null,null,null,{"$f":"Design!D32","v":13.958610825819848},{"$f":"COS(Design!D32*PI()/180)","v":0.97047023199782434},{"$f":"SIN(Design!D32*PI()/180)","v":0.24122091287052419},{"$f":"TAN(Design!D32*PI()/180)","v":0.24856085732165453}]
[null,null,null,{"$f":"E27","v":141.12},{"$f":"E26","v":0},null,null,null,null,null,null,null,null,null,{"$f":"O29/2","v":6.9793054129099241},{"$f":"COS(Design!D32*PI()/(180*2))","v":0.99259010472546627},{"$f":"SIN(Design!D32*PI()/(180*2))","v":0.12151083902717418},{"$f":"TAN(Design!D32*PI()/(180*2))","v":0.12241794316575624}]
[null,null,null,null,null,null,null,null,null,"dx","dy"]
[]
[]
[]
[]
[]
[]
[null,"Panel A","(baffle)",{"$f":"D71+Baffle_Offset","v":1.9},{"$f":"E70","v":18.532965009208102},null,{"$f":"IF(Design!$J$5=\"x\",Panels!D38,0)","v":1.9},{"$f":"IF(Design!$J$5=\"x\",Panels!E38,0)","v":18.532965009208102}]
[null,null,null,{"$f":"D38","v":1.9},{"$f":"E44","v":79.38},null,{"$f":"IF(Design!$J$5=\"x\",Panels!D39,0)","v":1.9},{"$f":"IF(Design!$J$5=\"x\",Panels!E39,0)","v":79.38},null,{"$f":"D38-D39","v":0},{"$f":"E38-E39","v":-60.847034990791897},{"$f":"(J39^2+K39^2)^0.5","v":60.847034990791897}]
[null,null,null,{"$f":"D39+p","v":3.8},{"$f":"E39","v":79.38},null,{"$f":"IF(Design!$J$5=\"x\",Panels!D40,0)","v":3.8},{"$f":"IF(Design!$J$5=\"x\",Panels!E40,0)","v":79.38},null,-1.9,0,{"$f":"(J40^2+K40^2)^0.5","v":1.9}]
[null,null,null,{"$f":"D40","v":3.8},{"$f":"E38","v":18.532965009208102},null,{"$f":"IF(Design!$J$5=\"x\",Panels!D41,0)","v":3.8},{"$f":"IF(Design!$J$5=\"x\",Panels!E41,0)","v":18.532965009208102},null,0,60.847034990791897,{"$f":"(J41^2+K41^2)^0.5","v":60.847034990791897}]
[null,null,null,{"$f":"D38","v":1.9},{"$f":"E38","v":18.532965009208102},null,{"$f":"IF(Design!$J$5=\"x\",Panels!D42,0)","v":1.9},{"$f":"IF(Design!$J$5=\"x\",Panels!E42,0)","v":18.532965009208102},null,1.9,0,{"$f":"(J42^2+K42^2)^0.5","v":1.9}]
[]
[null,"Panel B","(top)",{"$f":"D77","v":0},{"$f":"E76-p","v":79.38},null,{"$f":"IF(Design!$J$6=\"x\",Panels!D44,0)","v":0},{"$f":"IF(Design!$J$6=\"x\",Panels!E44,0)","v":79.38}]
[null,null,null,{"$f":"D44+Box_Depth","v":71.12},{"$f":"E44","v":79.38},null,{"$f":"IF(Design!$J$6=\"x\",Panels!D45,0)","v":71.12},{"$f":"IF(Design!$J$6=\"x\",Panels!E45,0)","v":79.38},null,{"$f":"D44-D45","v":-71.12},0,{"$f":"(J45^2+K45^2)^0.5","v":71.12}]
[null,null,null,{"$f":"D45","v":71.12},{"$f":"E45+p","v":81.28},null,{"$f":"IF(Design!$J$6=\"x\",Panels!D46,0)","v":71.12},{"$f":"IF(Design!$J$6=\"x\",Panels!E46,0)","v":81.28},null,0,-1.9000000000000057,{"$f":"(J46^2+K46^2)^0.5","v":1.9000000000000057}]
[null,null,null,{"$f":"D44","v":0},{"$f":"E46","v":81.28},null,{"$f":"IF(Design!$J$6=\"x\",Panels!D47,0)","v":0},{"$f":"IF(Design!$J$6=\"x\",Panels!E47,0)","v":81.28},null,71.12,0,{"$f":"(J47^2+K47^2)^0.5","v":71.12}]
[null,null,null,{"$f":"D44","v":0},{"$f":"E44","v":79.38},null,{"$f":"IF(Design!$J$6=\"x\",Panels!D48,0)","v":0},{"$f":"IF(Design!$J$6=\"x\",Panels!E48,0)","v":79.38},null,0,1.9000000000000057,{"$f":"(J48^2+K48^2)^0.5","v":1.9000000000000057}]
[]
[null,"Panel C","(bottom)",{"$f":"D74","v":0},{"$f":"E74+p","v":1.9},null,{"$f":"IF(Design!$J$7=\"x\",Panels!D50,0)","v":0},{"$f":"IF(Design!$J$7=\"x\",Panels!E50,0)","v":1.9}]
[null,null,null,{"$f":"D75","v":71.12},{"$f":"E50","v":1.9},null,{"$f":"IF(Design!$J$7=\"x\",Panels!D51,0)","v":71.12},{"$f":"IF(Design!$J$7=\"x\",Panels!E51,0)","v":1.9},null,{"$f":"D50-D51","v":-71.12},0,{"$f":"(J51^2+K51^2)^0.5","v":71.12}]
[null,null,null,{"$f":"D51","v":71.12},{"$f":"E51-p","v":0},null,{"$f":"IF(Design!$J$7=\"x\",Panels!D52,0)","v":71.12},{"$f":"IF(Design!$J$7=\"x\",Panels!E52,0)","v":0},null,0,1.9,{"$f":"(J52^2+K52^2)^0.5","v":1.9}]
[null,null,null,{"$f":"D50","v":0},{"$f":"E52","v":0},null,{"$f":"IF(Design!$J$7=\"x\",Panels!D53,0)","v":0},{"$f":"IF(Design!$J$7=\"x\",Panels!E53,0)","v":0},null,71.12,0,{"$f":"(J53^2+K53^2)^0.5","v":71.12}]
[null,null,null,{"$f":"D50","v":0},{"$f":"E50","v":1.9},null,{"$f":"IF(Design!$J$7=\"x\",Panels!D54,0)","v":0},{"$f":"IF(Design!$J$7=\"x\",Panels!E54,0)","v":1.9},null,0,-1.9,{"$f":"(J54^2+K54^2)^0.5","v":1.9}]
[]
[null,"Panel D","(back)",{"$f":"D75","v":71.12},{"$f":"E74+p","v":1.9},null,{"$f":"IF(Design!$J$8=\"x\",Panels!D56,0)","v":71.12},{"$f":"IF(Design!$J$8=\"x\",Panels!E56,0)","v":1.9}]
[null,null,null,{"$f":"D56-p","v":69.22},{"$f":"E56","v":1.9},null,{"$f":"IF(Design!$J$8=\"x\",Panels!D57,0)","v":69.22},{"$f":"IF(Design!$J$8=\"x\",Panels!E57,0)","v":1.9},null,{"$f":"D56-D57","v":1.9000000000000057},0,{"$f":"(J57^2+K57^2)^0.5","v":1.9000000000000057}]
[null,null,null,{"$f":"D57","v":69.22},{"$f":"E45","v":79.38},null,{"$f":"IF(Design!$J$8=\"x\",Panels!D58,0)","v":69.22},{"$f":"IF(Design!$J$8=\"x\",Panels!E58,0)","v":79.38},null,0,-77.47999999999999,{"$f":"(J58^2+K58^2)^0.5","v":77.47999999999999}]
[null,null,null,{"$f":"D58+p","v":71.12},{"$f":"E58","v":79.38},null,{"$f":"IF(Design!$J$8=\"x\",Panels!D59,0)","v":71.12},{"$f":"IF(Design!$J$8=\"x\",Panels!E59,0)","v":79.38},null,-1.9000000000000057,0,{"$f":"(J59^2+K59^2)^0.5","v":1.9000000000000057}]
[null,null,null,{"$f":"D56","v":71.12},{"$f":"E56","v":1.9},null,{"$f":"IF(Design!$J$8=\"x\",Panels!D60,0)","v":71.12},{"$f":"IF(Design!$J$8=\"x\",Panels!E60,0)","v":1.9},null,0,77.47999999999999,{"$f":"(J60^2+K60^2)^0.5","v":77.47999999999999}]
[]
[null,"Panel E","(1st inside)",{"$f":"D57","v":69.22},{"$f":"E70+Panel_E_Offset+p*P29+(E68-E50)","v":34.480348631465397},null,{"$f":"IF(Design!$J$9=\"x\",Panels!D62,0)","v":69.22},{"$f":"IF(Design!$J$9=\"x\",Panels!E62,0)","v":34.480348631465397}]
[null,null,null,{"$f":"D62-Panel_E*P29","v":32.83920821411472},{"$f":"E62+Panel_E*Q29","v":43.523189427805647},null,{"$f":"IF(Design!$J$9=\"x\",Panels!D63,0)","v":32.83920821411472},{"$f":"IF(Design!$J$9=\"x\",Panels!E63,0)","v":43.523189427805647},null,{"$f":"D62-D63","v":36.380791785885279},-9.0428407963402506,{"$f":"(J63^2+K63^2)^0.5","v":37.487797756548638}]
[null,null,null,{"$f":"D63-p*Q29","v":32.380888479660726},{"$f":"E63-p*P29","v":41.67929598700978},null,{"$f":"IF(Design!$J$9=\"x\",Panels!D64,0)","v":32.380888479660726},{"$f":"IF(Design!$J$9=\"x\",Panels!E64,0)","v":41.67929598700978},null,0.45831973445399399,1.8438934407958669,{"$f":"(J64^2+K64^2)^0.5","v":1.9000000000000001}]
[null,null,null,{"$f":"D62-p*Q29","v":68.761680265546005},{"$f":"E62-p*P29","v":32.63645519066953},null,{"$f":"IF(Design!$J$9=\"x\",Panels!D65,0)","v":68.761680265546005},{"$f":"IF(Design!$J$9=\"x\",Panels!E65,0)","v":32.63645519066953},null,-36.380791785885279,9.0428407963402506,{"$f":"(J65^2+K65^2)^0.5","v":37.487797756548638}]
[null,null,null,{"$f":"D62","v":69.22},{"$f":"E62","v":34.480348631465397},null,{"$f":"IF(Design!$J$9=\"x\",Panels!D66,0)","v":69.22},{"$f":"IF(Design!$J$9=\"x\",Panels!E66,0)","v":34.480348631465397},null,-0.45831973445399399,-1.8438934407958669,{"$f":"(J66^2+K66^2)^0.5","v":1.9000000000000001}]
[]
[null,"Panel F","(2nd inside)",{"$f":"D47","v":0},{"$f":"E50+sim_S4/(Baffle_Width-p)","v":16.632965009208103},null,{"$f":"IF(Design!$J$10=\"x\",Panels!D68,0)","v":0},{"$f":"IF(Design!$J$10=\"x\",Panels!E68,0)","v":16.632965009208103}]
[null,null,null,{"$f":"D62-(sim_S4/Baffle_Width)","v":54.985124555160141},{"$f":"E68","v":16.632965009208103},null,{"$f":"IF(Design!$J$10=\"x\",Panels!D69,0)","v":54.985124555160141},{"$f":"IF(Design!$J$10=\"x\",Panels!E69,0)","v":16.632965009208103},null,{"$f":"D68-D69","v":-54.985124555160141},0,{"$f":"(J69^2+K69^2)^0.5","v":54.985124555160141}]
[null,null,null,{"$f":"D69","v":54.985124555160141},{"$f":"E69+p","v":18.532965009208102},null,{"$f":"IF(Design!$J$10=\"x\",Panels!D70,0)","v":54.985124555160141},{"$f":"IF(Design!$J$10=\"x\",Panels!E70,0)","v":18.532965009208102},null,0,-1.8999999999999986,{"$f":"(J70^2+K70^2)^0.5","v":1.8999999999999986}]
[null,null,null,{"$f":"D68","v":0},{"$f":"E70","v":18.532965009208102},null,{"$f":"IF(Design!$J$10=\"x\",Panels!D71,0)","v":0},{"$f":"IF(Design!$J$10=\"x\",Panels!E71,0)","v":18.532965009208102},null,54.985124555160141,0,{"$f":"(J71^2+K71^2)^0.5","v":54.985124555160141}]
[null,null,null,{"$f":"D68","v":0},{"$f":"E68","v":16.632965009208103},null,{"$f":"IF(Design!$J$10=\"x\",Panels!D72,0)","v":0},{"$f":"IF(Design!$J$10=\"x\",Panels!E72,0)","v":16.632965009208103},null,0,1.8999999999999986,{"$f":"(J72^2+K72^2)^0.5","v":1.8999999999999986}]
[]
[null,"Panel G","(sides)",{"$f":"D3","v":0},{"$f":"E3","v":0},null,{"$f":"IF(Design!$J$11=\"x\",Panels!D74,0)","v":0},{"$f":"IF(Design!$J$11=\"x\",Panels!E74,0)","v":0}]
[null,null,null,{"$f":"D74+Box_Depth","v":71.12},{"$f":"E74","v":0},null,{"$f":"IF(Design!$J$11=\"x\",Panels!D75,0)","v":71.12},{"$f":"IF(Design!$J$11=\"x\",Panels!E75,0)","v":0},null,{"$f":"D74-D75","v":-71.12},0,{"$f":"(J75^2+K75^2)^0.5","v":71.12}]
[null,null,null,{"$f":"D75","v":71.12},{"$f":"E75+Box_Height","v":81.28},null,{"$f":"IF(Design!$J$11=\"x\",Panels!D76,0)","v":71.12},{"$f":"IF(Design!$J$11=\"x\",Panels!E76,0)","v":81.28},null,0,-81.28,{"$f":"(J76^2+K76^2)^0.5","v":81.28}]
[null,null,null,{"$f":"D74","v":0},{"$f":"E76","v":81.28},null,{"$f":"IF(Design!$J$11=\"x\",Panels!D77,0)","v":0},{"$f":"IF(Design!$J$11=\"x\",Panels!E77,0)","v":81.28},null,71.12,0,{"$f":"(J77^2+K77^2)^0.5","v":71.12}]
[null,null,null,{"$f":"D74","v":0},{"$f":"E74","v":0},null,{"$f":"IF(Design!$J$11=\"x\",Panels!D78,0)","v":0},{"$f":"IF(Design!$J$11=\"x\",Panels!E78,0)","v":0},null,0,81.28,{"$f":"(J78^2+K78^2)^0.5","v":81.28}]
[]
[null,"Panel H","(port separator)",{"$f":"D50","v":0},{"$f":"E50","v":1.9},null,{"$f":"IF(Design!$J$12=\"x\",Panels!D80,0)","v":0},{"$f":"IF(Design!$J$12=\"x\",Panels!E80,0)","v":1.9}]
[null,null,null,{"$f":"D57","v":69.22},{"$f":"E80","v":1.9},null,{"$f":"IF(Design!$J$12=\"x\",Panels!D81,0)","v":69.22},{"$f":"IF(Design!$J$12=\"x\",Panels!E81,0)","v":1.9},null,{"$f":"D80-D81","v":-69.22},{"$f":"E80-E81","v":0},{"$f":"(J81^2+K81^2)^0.5","v":69.22}]
[null,null,null,{"$f":"D81","v":69.22},{"$f":"E69","v":16.632965009208103},null,{"$f":"IF(Design!$J$12=\"x\",Panels!D82,0)","v":69.22},{"$f":"IF(Design!$J$12=\"x\",Panels!E82,0)","v":16.632965009208103},null,0,-14.732965009208103,{"$f":"(J82^2+K82^2)^0.5","v":14.732965009208103}]
[null,null,null,{"$f":"D80","v":0},{"$f":"E82","v":16.632965009208103},null,{"$f":"IF(Design!$J$12=\"x\",Panels!D83,0)","v":0},{"$f":"IF(Design!$J$12=\"x\",Panels!E83,0)","v":16.632965009208103},null,69.22,0,{"$f":"(J83^2+K83^2)^0.5","v":69.22}]
[null,null,null,{"$f":"D80","v":0},{"$f":"E80","v":1.9},null,{"$f":"IF(Design!$J$12=\"x\",Panels!D84,0)","v":0},{"$f":"IF(Design!$J$12=\"x\",Panels!E84,0)","v":1.9},null,0,14.732965009208103,{"$f":"(J84^2+K84^2)^0.5","v":14.732965009208103}]
[]
[]
[null,"Profile View"]
[null,null,null,{"$f":"D75+10","v":81.12},{"$f":"E74","v":0},null,{"$f":"IF(Design!$J$14=\"x\",Panels!D88,\"\")","v":81.12},{"$f":"IF(Design!$J$14=\"x\",Panels!E88,\"\")","v":0}]
[null,null,null,{"$f":"D88+Box_Width","v":141.12},{"$f":"E88","v":0},null,{"$f":"IF(Design!$J$14=\"x\",Panels!D89,\"\")","v":141.12},{"$f":"IF(Design!$J$14=\"x\",Panels!E89,\"\")","v":0},null,{"$f":"D88-D89","v":-60},{"$f":"E88-E89","v":0},{"$f":"(J89^2+K89^2)^0.5","v":60}]
[null,null,null,{"$f":"D89","v":141.12},{"$f":"E76","v":81.28},null,{"$f":"IF(Design!$J$14=\"x\",Panels!D90,\"\")","v":141.12},{"$f":"IF(Design!$J$14=\"x\",Panels!E90,\"\")","v":81.28},null,0,-81.28,{"$f":"(J90^2+K90^2)^0.5","v":81.28}]
[null,null,null,{"$f":"D88","v":81.12},{"$f":"E90","v":81.28},null,{"$f":"IF(Design!$J$14=\"x\",Panels!D91,\"\")","v":81.12},{"$f":"IF(Design!$J$14=\"x\",Panels!E91,\"\")","v":81.28},null,60,0,{"$f":"(J91^2+K91^2)^0.5","v":60}]
[null,null,null,{"$f":"D88","v":81.12},{"$f":"E88","v":0},null,{"$f":"IF(Design!$J$14=\"x\",Panels!D92,\"\")","v":81.12},{"$f":"IF(Design!$J$14=\"x\",Panels!E92,\"\")","v":0},null,0,81.28,{"$f":"(J92^2+K92^2)^0.5","v":81.28}]
[]
[null,null,null,{"$f":"D88","v":81.12},{"$f":"E88","v":0},null,{"$f":"IF(Design!$J$14=\"x\",Panels!D94,\"\")","v":81.12},{"$f":"IF(Design!$J$14=\"x\",Panels!E94,\"\")","v":0}]
[null,null,null,{"$f":"D94+p","v":83.02000000000001},{"$f":"E94","v":0},null,{"$f":"IF(Design!$J$14=\"x\",Panels!D95,\"\")","v":83.02000000000001},{"$f":"IF(Design!$J$14=\"x\",Panels!E95,\"\")","v":0},null,{"$f":"D94-D95","v":-1.9000000000000057},{"$f":"E94-E95","v":0},{"$f":"(J95^2+K95^2)^0.5","v":1.9000000000000057}]
[null,null,null,{"$f":"D95","v":83.02000000000001},{"$f":"E90","v":81.28},null,{"$f":"IF(Design!$J$14=\"x\",Panels!D96,\"\")","v":83.02000000000001},{"$f":"IF(Design!$J$14=\"x\",Panels!E96,\"\")","v":81.28},null,0,-81.28,{"$f":"(J96^2+K96^2)^0.5","v":81.28}]
[null,null,null,{"$f":"D94","v":81.12},{"$f":"E96","v":81.28},null,{"$f":"IF(Design!$J$14=\"x\",Panels!D97,\"\")","v":81.12},{"$f":"IF(Design!$J$14=\"x\",Panels!E97,\"\")","v":81.28},null,1.9000000000000057,0,{"$f":"(J97^2+K97^2)^0.5","v":1.9000000000000057}]
[null,null,null,{"$f":"D94","v":81.12},{"$f":"E94","v":0},null,{"$f":"IF(Design!$J$14=\"x\",Panels!D98,\"\")","v":81.12},{"$f":"IF(Design!$J$14=\"x\",Panels!E98,\"\")","v":0},null,0,81.28,{"$f":"(J98^2+K98^2)^0.5","v":81.28}]
[]
[null,null,null,{"$f":"D89-p","v":139.22},{"$f":"E89","v":0},null,{"$f":"IF(Design!$J$14=\"x\",Panels!D100,\"\")","v":139.22},{"$f":"IF(Design!$J$14=\"x\",Panels!E100,\"\")","v":0}]
[null,null,null,{"$f":"D89","v":141.12},{"$f":"E100","v":0},null,{"$f":"IF(Design!$J$14=\"x\",Panels!D101,\"\")","v":141.12},{"$f":"IF(Design!$J$14=\"x\",Panels!E101,\"\")","v":0},null,{"$f":"D100-D101","v":-1.9000000000000057},{"$f":"E100-E101","v":0},{"$f":"(J101^2+K101^2)^0.5","v":1.9000000000000057}]
[null,null,null,{"$f":"D101","v":141.12},{"$f":"E96","v":81.28},null,{"$f":"IF(Design!$J$14=\"x\",Panels!D102,\"\")","v":141.12},{"$f":"IF(Design!$J$14=\"x\",Panels!E102,\"\")","v":81.28},null,0,-81.28,{"$f":"(J102^2+K102^2)^0.5","v":81.28}]
[null,null,null,{"$f":"D100","v":139.22},{"$f":"E102","v":81.28},null,{"$f":"IF(Design!$J$14=\"x\",Panels!D103,\"\")","v":139.22},{"$f":"IF(Design!$J$14=\"x\",Panels!E103,\"\")","v":81.28},null,1.9000000000000057,0,{"$f":"(J103^2+K103^2)^0.5","v":1.9000000000000057}]
[null,null,null,{"$f":"D100","v":139.22},{"$f":"E100","v":0},null,{"$f":"IF(Design!$J$14=\"x\",Panels!D104,\"\")","v":139.22},{"$f":"IF(Design!$J$14=\"x\",Panels!E104,\"\")","v":0},null,0,81.28,{"$f":"(J104^2+K104^2)^0.5","v":81.28}]
[]
[null,null,null,{"$f":"D95","v":83.02000000000001},{"$f":"E95","v":0},null,{"$f":"IF(Design!$J$14=\"x\",Panels!D106,\"\")","v":83.02000000000001},{"$f":"IF(Design!$J$14=\"x\",Panels!E106,\"\")","v":0}]
[null,null,null,{"$f":"D95","v":83.02000000000001},{"$f":"E106+p","v":1.9},null,{"$f":"IF(Design!$J$14=\"x\",Panels!D107,\"\")","v":83.02000000000001},{"$f":"IF(Design!$J$14=\"x\",Panels!E107,\"\")","v":1.9},null,{"$f":"D106-D107","v":0},{"$f":"E106-E107","v":-1.9},{"$f":"(J107^2+K107^2)^0.5","v":1.9}]
[null,null,null,{"$f":"D100","v":139.22},{"$f":"E107","v":1.9},null,{"$f":"IF(Design!$J$14=\"x\",Panels!D108,\"\")","v":139.22},{"$f":"IF(Design!$J$14=\"x\",Panels!E108,\"\")","v":1.9},null,-56.199999999999989,0,{"$f":"(J108^2+K108^2)^0.5","v":56.199999999999989}]
[null,null,null,{"$f":"D108","v":139.22},{"$f":"E106","v":0},null,{"$f":"IF(Design!$J$14=\"x\",Panels!D109,\"\")","v":139.22},{"$f":"IF(Design!$J$14=\"x\",Panels!E109,\"\")","v":0},null,0,1.9,{"$f":"(J109^2+K109^2)^0.5","v":1.9}]
[null,null,null,{"$f":"D106","v":83.02000000000001},{"$f":"E106","v":0},null,{"$f":"IF(Design!$J$14=\"x\",Panels!D110,\"\")","v":83.02000000000001},{"$f":"IF(Design!$J$14=\"x\",Panels!E110,\"\")","v":0},null,56.199999999999989,0,{"$f":"(J110^2+K110^2)^0.5","v":56.199999999999989}]
[]
[null,null,null,{"$f":"D106","v":83.02000000000001},{"$f":"E96","v":81.28},null,{"$f":"IF(Design!$J$14=\"x\",Panels!D112,\"\")","v":83.02000000000001},{"$f":"IF(Design!$J$14=\"x\",Panels!E112,\"\")","v":81.28}]
[null,null,null,{"$f":"D103","v":139.22},{"$f":"E112","v":81.28},null,{"$f":"IF(Design!$J$14=\"x\",Panels!D113,\"\")","v":139.22},{"$f":"IF(Design!$J$14=\"x\",Panels!E113,\"\")","v":81.28},null,{"$f":"D112-D113","v":-56.199999999999989},{"$f":"E112-E113","v":0},{"$f":"(J113^2+K113^2)^0.5","v":56.199999999999989}]
[null,null,null,{"$f":"D113","v":139.22},{"$f":"E113-p","v":79.38},null,{"$f":"IF(Design!$J$14=\"x\",Panels!D114,\"\")","v":139.22},{"$f":"IF(Design!$J$14=\"x\",Panels!E114,\"\")","v":79.38},null,0,1.9000000000000057,{"$f":"(J114^2+K114^2)^0.5","v":1.9000000000000057}]
[null,null,null,{"$f":"D112","v":83.02000000000001},{"$f":"E114","v":79.38},null,{"$f":"IF(Design!$J$14=\"x\",Panels!D115,\"\")","v":83.02000000000001},{"$f":"IF(Design!$J$14=\"x\",Panels!E115,\"\")","v":79.38},null,56.199999999999989,0,{"$f":"(J115^2+K115^2)^0.5","v":56.199999999999989}]
[null,null,null,{"$f":"D112","v":83.02000000000001},{"$f":"E112","v":81.28},null,{"$f":"IF(Design!$J$14=\"x\",Panels!D116,\"\")","v":83.02000000000001},{"$f":"IF(Design!$J$14=\"x\",Panels!E116,\"\")","v":81.28},null,0,-1.9000000000000057,{"$f":"(J116^2+K116^2)^0.5","v":1.9000000000000057}]
[]
[null,null,null,{"$f":"D112","v":83.02000000000001},{"$f":"E68","v":16.632965009208103},null,{"$f":"IF(Design!$J$14=\"x\",Panels!D118,\"\")","v":83.02000000000001},{"$f":"IF(Design!$J$14=\"x\",Panels!E118,\"\")","v":16.632965009208103}]
[null,null,null,{"$f":"D109","v":139.22},{"$f":"E118","v":16.632965009208103},null,{"$f":"IF(Design!$J$14=\"x\",Panels!D119,\"\")","v":139.22},{"$f":"IF(Design!$J$14=\"x\",Panels!E119,\"\")","v":16.632965009208103},null,{"$f":"D118-D119","v":-56.199999999999989},{"$f":"E118-E119","v":0},{"$f":"(J119^2+K119^2)^0.5","v":56.199999999999989}]
[null,null,null,{"$f":"D119","v":139.22},{"$f":"E70","v":18.532965009208102},null,{"$f":"IF(Design!$J$14=\"x\",Panels!D120,\"\")","v":139.22},{"$f":"IF(Design!$J$14=\"x\",Panels!E120,\"\")","v":18.532965009208102},null,0,-1.8999999999999986,{"$f":"(J120^2+K120^2)^0.5","v":1.8999999999999986}]
[null,null,null,{"$f":"D118","v":83.02000000000001},{"$f":"E120","v":18.532965009208102},null,{"$f":"IF(Design!$J$14=\"x\",Panels!D121,\"\")","v":83.02000000000001},{"$f":"IF(Design!$J$14=\"x\",Panels!E121,\"\")","v":18.532965009208102},null,56.199999999999989,0,{"$f":"(J121^2+K121^2)^0.5","v":56.199999999999989}]
[null,null,null,{"$f":"D118","v":83.02000000000001},{"$f":"E118","v":16.632965009208103},null,{"$f":"IF(Design!$J$14=\"x\",Panels!D122,\"\")","v":83.02000000000001},{"$f":"IF(Design!$J$14=\"x\",Panels!E122,\"\")","v":16.632965009208103},null,0,1.8999999999999986,{"$f":"(J122^2+K122^2)^0.5","v":1.8999999999999986}]
[]
[null,null,null,{"$f":"(D96+D108-p)/2","v":110.17},{"$f":"E108","v":1.9},null,{"$f":"IF(Design!$J$14=\"x\",Panels!D124,\"\")","v":110.17},{"$f":"IF(Design!$J$14=\"x\",Panels!E124,\"\")","v":1.9}]
[null,null,null,{"$f":"D124+p","v":112.07000000000001},{"$f":"E124","v":1.9},null,{"$f":"IF(Design!$J$14=\"x\",Panels!D125,\"\")","v":112.07000000000001},{"$f":"IF(Design!$J$14=\"x\",Panels!E125,\"\")","v":1.9},null,{"$f":"D124-D125","v":-1.9000000000000057},{"$f":"E124-E125","v":0},{"$f":"(J125^2+K125^2)^0.5","v":1.9000000000000057}]
[null,null,null,{"$f":"D125","v":112.07000000000001},{"$f":"E82","v":16.632965009208103},null,{"$f":"IF(Design!$J$14=\"x\",Panels!D126,\"\")","v":112.07000000000001},{"$f":"IF(Design!$J$14=\"x\",Panels!E126,\"\")","v":16.632965009208103},null,0,-14.732965009208103,{"$f":"(J126^2+K126^2)^0.5","v":14.732965009208103}]
[null,null,null,{"$f":"D124","v":110.17},{"$f":"E126","v":16.632965009208103},null,{"$f":"IF(Design!$J$14=\"x\",Panels!D127,\"\")","v":110.17},{"$f":"IF(Design!$J$14=\"x\",Panels!E127,\"\")","v":16.632965009208103},null,1.9000000000000057,0,{"$f":"(J127^2+K127^2)^0.5","v":1.9000000000000057}]
[null,null,null,{"$f":"D124","v":110.17},{"$f":"E124","v":1.9},null,{"$f":"IF(Design!$J$14=\"x\",Panels!D128,\"\")","v":110.17},{"$f":"IF(Design!$J$14=\"x\",Panels!E128,\"\")","v":1.9},null,0,14.732965009208103,{"$f":"(J128^2+K128^2)^0.5","v":14.732965009208103}]

{"sheet":"Path","index":5,"n_rows":70,"n_cols":33,"rows_kept":70,"cut":false,"hidden":true,"merged":[]}
[]
[]
[null,"Path Calculations",null,"x","y",null,"x","y",null,"d","x","y","dS","d","L","S",null,null,null,null,null,null,null,null,"Intersection points","x1","y1","x2","y2","a","b","x","y"]
[]
[null,null,null,{"$f":"AF6","v":71.968261484697777},{"$f":"AG6","v":79.38},null,{"$f":"IF(Design!$J$18=\"x\",D5,0)","v":71.968261484697777},{"$f":"IF(Design!$J$18=\"x\",E5,0)","v":79.38},{"$f":"SUM(D5:D6)/2","v":69.26057776202623},{"$f":"SUM(E5:E6)/2","v":57.261643387805542},{"$f":"IF(Design!$J$17=\"x\",I5,0)","v":69.26057776202623},{"$f":"IF(Design!$J$17=\"x\",J5,0)","v":57.261643387805542},null,{"$f":"N4","v":0},0,{"$f":"P4","v":0},null,null,null,null,null,null,null,null,"Sample point",{"$f":"D6","v":66.552894039354683},{"$f":"E6","v":35.143286775611088},{"$f":"Z5+10*Panels!Q30","v":67.768002429626421},{"$f":"AA5+10*Panels!P30","v":45.06918782286575},{"$f":"(AC5-AA5)/(AB5-Z5)","v":8.168737148654623},{"$f":"(AC5*Z5-AA5*AB5)/(Z5-AB5)","v":-508.50981111414052}]
[null,"S1",{"$f":"C2+1","v":1},{"$f":"(Panels!D58+D9)/2","v":66.552894039354683},{"$f":"(Panels!E62+E9)/2","v":35.143286775611088},null,{"$f":"IF(Design!$J$18=\"x\",D6,0)","v":66.552894039354683},{"$f":"IF(Design!$J$18=\"x\",E6,0)","v":35.143286775611088},null,null,{"$f":"K5","v":69.26057776202623},{"$f":"L5","v":57.261643387805542},null,{"$f":"N5","v":0},{"$f":"O5","v":0},0,null,null,null,null,null,null,null,null,"Panel C",{"$f":"Panels!D44","v":0},{"$f":"Panels!E44","v":79.38},{"$f":"Panels!D45","v":71.12},{"$f":"Panels!E45","v":79.38},{"$f":"(AC6-AA6)/(AB6-Z6)","v":0},{"$f":"(AC6*Z6-AA6*AB6)/(Z6-AB6)","v":79.38},{"$f":"(AE5-AE6)/(AD6-AD5)","v":71.968261484697777},{"$f":"AF6*AD6+AE6","v":79.38}]
[null,null,null,null,null,null,null,null,null,null,{"$f":"K6","v":69.26057776202623},{"$f":"L6","v":57.261643387805542},null,0,{"$f":"O4+N7","v":0},{"$f":"(((D5-D6)^2+(E5-E6)^2)^0.5)*Design!$D$20","v":2504.6625705565248},{"$f":"P7/2","v":1252.3312852782624},{"$f":"-Q7","v":-1252.3312852782624},{"$f":"(Q7-T7)*2","v":4.5722430559180793E-4},{"$f":"(($E$69-$E$68)*(O7-$F$68)/($F$69-$F$68)+$E$68)/2","v":1252.3310566661096},{"$f":"-T7","v":-1252.3310566661096},{"$f":"IF(C6>0,L7,\"\")","v":57.261643387805542}]
[null,null,null,{"$f":"Panels!D58","v":69.22},{"$f":"E5","v":79.38},null,{"$f":"IF(Design!$J$18=\"x\",D8,0)","v":69.22},{"$f":"IF(Design!$J$18=\"x\",E8,0)","v":79.38},{"$f":"SUM(D8:D9)/2","v":66.552894039354683},{"$f":"SUM(E8:E9)/2","v":57.593112459878384},{"$f":"IF(Design!$J$17=\"x\",I8,0)","v":66.552894039354683},{"$f":"IF(Design!$J$17=\"x\",J8,0)","v":57.593112459878384},null,{"$f":"N7","v":0},0,{"$f":"P7","v":2504.6625705565248},{"$f":"P8/2","v":1252.3312852782624},{"$f":"-Q8","v":-1252.3312852782624},{"$f":"(Q8-T8)*2","v":4.5722430559180793E-4},{"$f":"(($E$69-$E$68)*(O8-$F$68)/($F$69-$F$68)+$E$68)/2","v":1252.3310566661096},{"$f":"-T8","v":-1252.3310566661096},{"$f":"IF(C9>0,L8,\"\")","v":57.593112459878384},null,null,"Sample point",{"$f":"Panels!D58","v":69.22},{"$f":"Panels!E58","v":79.38},{"$f":"Z8+10*Panels!Q30","v":70.435108390271736},{"$f":"AA8+10*Panels!P30","v":89.30590104725465},{"$f":"(AC8-AA8)/(AB8-Z8)","v":8.1687371486546176},{"$f":"(AC8*Z8-AA8*AB8)/(Z8-AB8)","v":-486.05998542987277}]
[null,null,{"$f":"C6+1","v":2},{"$f":"AF9","v":63.885788078709375},{"$f":"AG9","v":35.806224919756772},null,{"$f":"IF(Design!$J$18=\"x\",D9,0)","v":63.885788078709375},{"$f":"IF(Design!$J$18=\"x\",E9,0)","v":35.806224919756772},null,null,{"$f":"K8","v":66.552894039354683},{"$f":"L8","v":57.593112459878384},null,{"$f":"N8","v":0},0,{"$f":"P8","v":2504.6625705565248},1252.3312852782624,-1252.3312852782624,4.5722430559180793E-4,1252.3310566661096,-1252.3310566661096,{"$f":"IF(C9>0,L9,\"\")","v":57.593112459878384},null,null,"Panel E",{"$f":"Panels!D62","v":69.22},{"$f":"Panels!E62","v":34.480348631465397},{"$f":"Panels!D63","v":32.83920821411472},{"$f":"Panels!E63","v":43.523189427805647},{"$f":"(AC9-AA9)/(AB9-Z9)","v":-0.2485608573216545},{"$f":"(AC9*Z9-AA9*AB9)/(Z9-AB9)","v":51.685731175270313},{"$f":"(AE8-AE9)/(AD9-AD8)","v":63.885788078709375},{"$f":"AF9*AD9+AE9","v":35.806224919756772}]
[null,null,null,null,null,null,null,null,null,null,{"$f":"K9","v":66.552894039354683},{"$f":"L9","v":57.593112459878384},null,{"$f":"((I8-I5)^2+(J8-J5)^2)^0.5","v":2.7278971549091211},{"$f":"O7+N10","v":2.7278971549091211},{"$f":"(((D8-D9)^2+(E8-E9)^2)^0.5)*Design!$D$20","v":2467.127314539347},1233.5636572696735,-1233.5636572696735,0,1233.5636572696735,-1233.5636572696735,{"$f":"IF(C9>0,L10,\"\")","v":57.593112459878384}]
[null,null,null,{"$f":"Panels!D63","v":32.83920821411472},{"$f":"Panels!E63","v":43.523189427805647},null,{"$f":"IF(Design!$J$18=\"x\",D11,0)","v":32.83920821411472},{"$f":"IF(Design!$J$18=\"x\",E11,0)","v":43.523189427805647},{"$f":"SUM(D11:D12)/2","v":35.017703782847612},{"$f":"SUM(E11:E12)/2","v":61.451594713902821},{"$f":"IF(Design!$J$17=\"x\",I11,0)","v":35.017703782847612},{"$f":"IF(Design!$J$17=\"x\",J11,0)","v":61.451594713902821},null,{"$f":"N10","v":2.7278971549091211},2.7278971549091211,{"$f":"P10","v":2467.127314539347},{"$f":"P11/2","v":1233.5636572696735},{"$f":"-Q11","v":-1233.5636572696735},{"$f":"(Q11-T11)*2","v":0},1233.5636572696735,{"$f":"-T11","v":-1233.5636572696735},{"$f":"IF(C12>0,L11,\"\")","v":61.451594713902821}]
[null,null,{"$f":"C9+1","v":3},{"$f":"D11+(E5-E11)*Panels!Q30","v":37.196199351580503},{"$f":"E5","v":79.38},null,{"$f":"IF(Design!$J$18=\"x\",D12,0)","v":37.196199351580503},{"$f":"IF(Design!$J$18=\"x\",E12,0)","v":79.38},null,null,{"$f":"K11","v":35.017703782847612},{"$f":"L11","v":61.451594713902821},null,{"$f":"N11","v":2.7278971549091211},2.7278971549091211,{"$f":"P11","v":2467.127314539347},1233.5636572696735,-1233.5636572696735,0,1233.5636572696735,-1233.5636572696735,{"$f":"IF(C12>0,L12,\"\")","v":61.451594713902821}]
[null,null,null,null,null,null,null,null,null,null,{"$f":"K12","v":35.017703782847612},{"$f":"L12","v":61.451594713902821},null,{"$f":"((I11-I8)^2+(J11-J8)^2)^0.5","v":31.77036527675941},{"$f":"O10+N13","v":34.498262431668529},{"$f":"(((D11-D12)^2+(E11-E12)^2)^0.5)*Design!$D$20","v":2029.9749908132508},1014.9874954066254,-1014.9874954066254,-4.5133355142752407E-3,1014.9897520743825,-1014.9897520743825,{"$f":"IF(C12>0,L13,\"\")","v":61.451594713902821}]
[null,null,null,{"$f":"(D12+Panels!D40)/2","v":20.49809967579025},{"$f":"E12","v":79.38},null,{"$f":"IF(Design!$J$18=\"x\",D14,0)","v":20.49809967579025},{"$f":"IF(Design!$J$18=\"x\",E14,0)","v":79.38},{"$f":"SUM(D14:D15)/2","v":26.668653944952485},{"$f":"SUM(E14:E15)/2","v":61.451594713902821},{"$f":"IF(Design!$J$17=\"x\",I14,0)","v":26.668653944952485},{"$f":"IF(Design!$J$17=\"x\",J14,0)","v":61.451594713902821},null,{"$f":"N13","v":31.77036527675941},{"$f":"O13","v":34.498262431668529},2029.9749908132508,1014.9874954066254,-1014.9874954066254,-4.5133355142752407E-3,1014.9897520743825,-1014.9897520743825,{"$f":"IF(C15>0,L14,\"\")","v":61.451594713902821}]
[null,null,{"$f":"C12+1","v":4},{"$f":"D11","v":32.83920821411472},{"$f":"E11","v":43.523189427805647},null,{"$f":"IF(Design!$J$18=\"x\",D15,0)","v":32.83920821411472},{"$f":"IF(Design!$J$18=\"x\",E15,0)","v":43.523189427805647},null,null,{"$f":"K14","v":26.668653944952485},{"$f":"L14","v":61.451594713902821},null,{"$f":"N14","v":31.77036527675941},{"$f":"O14","v":34.498262431668529},2029.9749908132508,1014.9874954066254,-1014.9874954066254,-4.5133355142752407E-3,1014.9897520743825,-1014.9897520743825,{"$f":"IF(C15>0,L15,\"\")","v":61.451594713902821}]
[null,null,null,null,null,null,null,null,null,null,{"$f":"K15","v":26.668653944952485},{"$f":"L15","v":61.451594713902821},null,{"$f":"((I14-I11)^2+(J14-J11)^2)^0.5","v":8.3490498378951266},{"$f":"O13+N16","v":42.847312269563659},{"$f":"(((D14-D15)^2+(E14-E15)^2)^0.5)*Design!$D$20","v":2131.1687834207737},1065.5843917103869,-1065.5843917103869,216.06894224357598,957.54992058859887,-957.54992058859887,{"$f":"IF(C15>0,L16,\"\")","v":61.451594713902821}]
[null,null,null,{"$f":"Panels!D40","v":3.8},{"$f":"(E14+E20)/2","v":63.215883991293765},null,{"$f":"IF(Design!$J$18=\"x\",D17,0)","v":3.8},{"$f":"IF(Design!$J$18=\"x\",E17,0)","v":63.215883991293765},{"$f":"SUM(D17:D18)/2","v":18.319604107057359},{"$f":"SUM(E17:E18)/2","v":53.369536709549706},{"$f":"IF(Design!$J$17=\"x\",I17,0)","v":18.319604107057359},{"$f":"IF(Design!$J$17=\"x\",J17,0)","v":53.369536709549706},null,{"$f":"N16","v":8.3490498378951266},{"$f":"O16","v":42.847312269563659},2131.1687834207737,1065.5843917103869,-1065.5843917103869,216.06894224357598,957.54992058859887,-957.54992058859887,{"$f":"IF(C18>0,L17,\"\")","v":53.369536709549706}]
[null,null,{"$f":"C15+1","v":5},{"$f":"D15","v":32.83920821411472},{"$f":"E15","v":43.523189427805647},null,{"$f":"IF(Design!$J$18=\"x\",D18,0)","v":32.83920821411472},{"$f":"IF(Design!$J$18=\"x\",E18,0)","v":43.523189427805647},null,null,{"$f":"K17","v":18.319604107057359},{"$f":"L17","v":53.369536709549706},null,{"$f":"N17","v":8.3490498378951266},{"$f":"O17","v":42.847312269563659},2131.1687834207737,1065.5843917103869,-1065.5843917103869,216.06894224357598,957.54992058859887,-957.54992058859887,{"$f":"IF(C18>0,L18,\"\")","v":53.369536709549706}]
[null,null,null,null,null,null,null,null,null,null,{"$f":"K18","v":18.319604107057359},{"$f":"L18","v":53.369536709549706},null,{"$f":"((I17-I14)^2+(J17-J14)^2)^0.5","v":11.62008153075463},{"$f":"O16+N19","v":54.467393800318291},{"$f":"(((D17-D18)^2+(E17-E18)^2)^0.5)*Design!$D$20","v":1971.873593935755},985.93679696787751,-985.93679696787751,216.66153350891932,877.60603021341785,-877.60603021341785,{"$f":"IF(C18>0,L19,\"\")","v":53.369536709549706}]
[null,null,null,{"$f":"D17","v":3.8},{"$f":"E21+(D21-D20)*Panels!Q30","v":47.051767982587535},null,{"$f":"IF(Design!$J$18=\"x\",D20,0)","v":3.8},{"$f":"IF(Design!$J$18=\"x\",E20,0)","v":47.051767982587535},{"$f":"SUM(D20:D21)/2","v":18.319604107057359},{"$f":"SUM(E20:E21)/2","v":45.287478705196591},{"$f":"IF(Design!$J$17=\"x\",I20,0)","v":18.319604107057359},{"$f":"IF(Design!$J$17=\"x\",J20,0)","v":45.287478705196591},null,{"$f":"N19","v":11.62008153075463},54.467393800318291,1971.873593935755,985.93679696787751,-985.93679696787751,216.66153350891932,877.60603021341785,-877.60603021341785,{"$f":"IF(C21>0,L20,\"\")","v":45.287478705196591}]
[null,null,{"$f":"C18+1","v":6},{"$f":"D18","v":32.83920821411472},{"$f":"E18","v":43.523189427805647},null,{"$f":"IF(Design!$J$18=\"x\",D21,0)","v":32.83920821411472},{"$f":"IF(Design!$J$18=\"x\",E21,0)","v":43.523189427805647},null,null,{"$f":"K20","v":18.319604107057359},{"$f":"L20","v":45.287478705196591},null,{"$f":"N20","v":11.62008153075463},54.467393800318291,1971.873593935755,985.93679696787751,-985.93679696787751,216.66153350891932,877.60603021341785,-877.60603021341785,{"$f":"IF(C21>0,L21,\"\")","v":45.287478705196591}]
[null,null,null,null,null,null,null,null,null,null,{"$f":"K21","v":18.319604107057359},{"$f":"L21","v":45.287478705196591},null,{"$f":"((I20-I17)^2+(J20-J17)^2)^0.5","v":8.0820580043531152},{"$f":"O19+N22","v":62.549451804671406},{"$f":"(((D20-D21)^2+(E20-E21)^2)^0.5)*Design!$D$20","v":1644.007525682842},822.00376284142101,-822.00376284142101,1.4249380985802418E-3,822.00305037237172,-822.00305037237172,{"$f":"IF(C21>0,L22,\"\")","v":45.287478705196591}]
[null,null,null,{"$f":"D20","v":3.8},{"$f":"E24+(D24-D23)*Panels!Q30","v":45.15218372631545},null,{"$f":"IF(Design!$J$18=\"x\",D23,0)","v":3.8},{"$f":"IF(Design!$J$18=\"x\",E23,0)","v":45.15218372631545},{"$f":"SUM(D23:D24)/2","v":18.090444239830362},{"$f":"SUM(E23:E24)/2","v":43.415739856662611},{"$f":"IF(Design!$J$17=\"x\",I23,0)","v":18.090444239830362},{"$f":"IF(Design!$J$17=\"x\",J23,0)","v":43.415739856662611},null,{"$f":"N22","v":8.0820580043531152},62.549451804671406,1644.007525682842,822.00376284142101,-822.00376284142101,1.4249380985802418E-3,822.00305037237172,-822.00305037237172,{"$f":"IF(C24>0,L23,\"\")","v":43.415739856662611}]
[null,null,{"$f":"C21+1","v":7},{"$f":"Panels!D64","v":32.380888479660726},{"$f":"Panels!E64","v":41.67929598700978},null,{"$f":"IF(Design!$J$18=\"x\",D24,0)","v":32.380888479660726},{"$f":"IF(Design!$J$18=\"x\",E24,0)","v":41.67929598700978},null,null,{"$f":"K23","v":18.090444239830362},{"$f":"L23","v":43.415739856662611},null,{"$f":"N23","v":8.0820580043531152},62.549451804671406,1644.007525682842,822.00376284142101,-822.00376284142101,1.4249380985802418E-3,822.00305037237172,-822.00305037237172,{"$f":"IF(C24>0,L24,\"\")","v":43.415739856662611}]
[null,null,null,null,null,null,null,null,null,null,{"$f":"K24","v":18.090444239830362},{"$f":"L24","v":43.415739856662611},null,{"$f":"((I23-I20)^2+(J23-J20)^2)^0.5","v":1.8857148675923419},{"$f":"O22+N25","v":64.435166672263748},{"$f":"(((D23-D24)^2+(E23-E24)^2)^0.5)*Design!$D$20","v":1618.0604996118936},809.03024980594682,-809.03024980594682,1.0985102912854927E-3,809.02970055080118,-809.02970055080118,{"$f":"IF(C24>0,L25,\"\")","v":43.415739856662611}]
[null,null,null,{"$f":"D17","v":3.8},{"$f":"(E23+E29)/2","v":31.842574367761777},null,{"$f":"IF(Design!$J$18=\"x\",D26,0)","v":3.8},{"$f":"IF(Design!$J$18=\"x\",E26,0)","v":31.842574367761777},{"$f":"SUM(D26:D27)/2","v":18.090444239830362},{"$f":"SUM(E26:E27)/2","v":36.760935177385775},{"$f":"IF(Design!$J$17=\"x\",I26,0)","v":18.090444239830362},{"$f":"IF(Design!$J$17=\"x\",J26,0)","v":36.760935177385775},null,{"$f":"N25","v":1.8857148675923419},64.435166672263748,1618.0604996118936,809.03024980594682,-809.03024980594682,1.0985102912854927E-3,809.02970055080118,-809.02970055080118,{"$f":"IF(C27>0,L26,\"\")","v":36.760935177385775}]
[null,null,{"$f":"C24+1","v":8},{"$f":"D24","v":32.380888479660726},{"$f":"E24","v":41.67929598700978},null,{"$f":"IF(Design!$J$18=\"x\",D27,0)","v":32.380888479660726},{"$f":"IF(Design!$J$18=\"x\",E27,0)","v":41.67929598700978},null,null,{"$f":"K26","v":18.090444239830362},{"$f":"L26","v":36.760935177385775},null,{"$f":"N26","v":1.8857148675923419},64.435166672263748,1618.0604996118936,809.03024980594682,-809.03024980594682,1.0985102912854927E-3,809.02970055080118,-809.02970055080118,{"$f":"IF(C27>0,L27,\"\")","v":36.760935177385775}]
[null,null,null,null,null,null,null,null,null,null,{"$f":"K27","v":18.090444239830362},{"$f":"L27","v":36.760935177385775},null,{"$f":"((I26-I23)^2+(J26-J23)^2)^0.5","v":6.6548046792768361},{"$f":"O25+N28","v":71.089971351540584},{"$f":"(((D26-D27)^2+(E26-E27)^2)^0.5)*Design!$D$20","v":1698.7171924572708},849.35859622863541,-849.35859622863541,172.22530305346299,763.24594470190391,-763.24594470190391,{"$f":"IF(C27>0,L28,\"\")","v":36.760935177385775}]
[null,null,null,{"$f":"(D26+D32)/2","v":16.673681124762204},{"$f":"Panels!E70","v":18.532965009208102},null,{"$f":"IF(Design!$J$18=\"x\",D29,0)","v":16.673681124762204},{"$f":"IF(Design!$J$18=\"x\",E29,0)","v":18.532965009208102},{"$f":"SUM(D29:D30)/2","v":24.527284802211465},{"$f":"SUM(E29:E30)/2","v":30.106130498108939},{"$f":"IF(Design!$J$17=\"x\",I29,0)","v":24.527284802211465},{"$f":"IF(Design!$J$17=\"x\",J29,0)","v":30.106130498108939},null,{"$f":"N28","v":6.6548046792768361},71.089971351540584,1698.7171924572708,849.35859622863541,-849.35859622863541,172.22530305346299,763.24594470190391,-763.24594470190391,{"$f":"IF(C30>0,L29,\"\")","v":30.106130498108939}]
[null,null,{"$f":"C27+1","v":9},{"$f":"D27","v":32.380888479660726},{"$f":"E27","v":41.67929598700978},null,{"$f":"IF(Design!$J$18=\"x\",D30,0)","v":32.380888479660726},{"$f":"IF(Design!$J$18=\"x\",E30,0)","v":41.67929598700978},null,null,{"$f":"K29","v":24.527284802211465},{"$f":"L29","v":30.106130498108939},null,{"$f":"N29","v":6.6548046792768361},71.089971351540584,1698.7171924572708,849.35859622863541,-849.35859622863541,172.22530305346299,763.24594470190391,-763.24594470190391,{"$f":"IF(C30>0,L30,\"\")","v":30.106130498108939}]
[null,null,null,null,null,null,null,null,null,null,{"$f":"K30","v":24.527284802211465},{"$f":"L30","v":30.106130498108939},null,{"$f":"((I29-I26)^2+(J29-J26)^2)^0.5","v":9.258474050557119},{"$f":"O28+N31","v":80.348445402097695},{"$f":"(((D29-D30)^2+(E29-E30)^2)^0.5)*Design!$D$20","v":1572.0627819301562},786.03139096507812,-786.03139096507812,172.96387726233911,699.54945233390856,-699.54945233390856,{"$f":"IF(C30>0,L31,\"\")","v":30.106130498108939}]
[null,null,null,{"$f":"AF33","v":29.547362249524408},{"$f":"AG33","v":18.532965009208102},null,{"$f":"IF(Design!$J$18=\"x\",D32,0)","v":29.547362249524408},{"$f":"IF(Design!$J$18=\"x\",E32,0)","v":18.532965009208102},{"$f":"SUM(D32:D33)/2","v":30.964125364592569},{"$f":"SUM(E32:E33)/2","v":30.106130498108939},{"$f":"IF(Design!$J$17=\"x\",I32,0)","v":30.964125364592569},{"$f":"IF(Design!$J$17=\"x\",J32,0)","v":30.106130498108939},null,{"$f":"N31","v":9.258474050557119},80.348445402097695,1572.0627819301562,786.03139096507812,-786.03139096507812,172.96387726233911,699.54945233390856,-699.54945233390856,{"$f":"IF(C33>0,L32,\"\")","v":30.106130498108939},null,null,"Sample Point",{"$f":"Panels!D64","v":32.380888479660726},{"$f":"Panels!E64","v":41.67929598700978},{"$f":"Z32-10*Panels!Q30","v":31.165780089388985},{"$f":"AA32-10*Panels!P30","v":31.753394939755118},{"$f":"(AC32-AA32)/(AB32-Z32)","v":8.1687371486545999},{"$f":"(AC32*Z32-AA32*AB32)/(Z32-AB32)","v":-222.83167064323646}]
[null,null,{"$f":"C30+1","v":10},{"$f":"D30","v":32.380888479660726},{"$f":"E30","v":41.67929598700978},null,{"$f":"IF(Design!$J$18=\"x\",D33,0)","v":32.380888479660726},{"$f":"IF(Design!$J$18=\"x\",E33,0)","v":41.67929598700978},null,null,{"$f":"K32","v":30.964125364592569},{"$f":"L32","v":30.106130498108939},null,{"$f":"N32","v":9.258474050557119},80.348445402097695,1572.0627819301562,786.03139096507812,-786.03139096507812,172.96387726233911,699.54945233390856,-699.54945233390856,{"$f":"IF(C33>0,L33,\"\")","v":30.106130498108939},null,null,"Sample Point",{"$f":"Panels!D71","v":0},{"$f":"Panels!E71","v":18.532965009208102},{"$f":"Panels!D70","v":54.985124555160141},{"$f":"Panels!E70","v":18.532965009208102},{"$f":"(AC33-AA33)/(AB33-Z33)","v":0},{"$f":"(AC33*Z33-AA33*AB33)/(Z33-AB33)","v":18.532965009208102},{"$f":"(AE32-AE33)/(AD33-AD32)","v":29.547362249524408},{"$f":"AF33*AD33+AE33","v":18.532965009208102}]
[null,null,null,null,null,null,null,null,null,null,{"$f":"K33","v":30.964125364592569},{"$f":"L33","v":30.106130498108939},null,{"$f":"((I32-I29)^2+(J32-J29)^2)^0.5","v":6.4368405623811036},{"$f":"O31+N34","v":86.785285964478803},{"$f":"(((D32-D33)^2+(E32-E33)^2)^0.5)*Design!$D$20","v":1310.5347260259464},655.26736301297319,-655.26736301297319,4.231987533330539E-3,655.26524701920653,-655.26524701920653,{"$f":"IF(C33>0,L34,\"\")","v":30.106130498108939}]
[null,null,null,{"$f":"AF36","v":57.06747956591655},{"$f":"AG36","v":35.543175742260928},null,{"$f":"IF(Design!$J$18=\"x\",D35,0)","v":57.06747956591655},{"$f":"IF(Design!$J$18=\"x\",E35,0)","v":35.543175742260928},{"$f":"SUM(D35:D36)/2","v":56.026302060538342},{"$f":"SUM(E35:E36)/2","v":27.038070375734513},{"$f":"IF(Design!$J$17=\"x\",I35,0)","v":56.026302060538342},{"$f":"IF(Design!$J$17=\"x\",J35,0)","v":27.038070375734513},null,{"$f":"N34","v":6.4368405623811036},86.785285964478803,1310.5347260259464,655.26736301297319,-655.26736301297319,4.231987533330539E-3,655.26524701920653,-655.26524701920653,{"$f":"IF(C36>0,L35,\"\")","v":27.038070375734513},null,null,"Panel E (bottom)",{"$f":"Panels!D64","v":32.380888479660726},{"$f":"Panels!E64","v":41.67929598700978},{"$f":"Panels!D65","v":68.761680265546005},{"$f":"Panels!E65","v":32.63645519066953},{"$f":"(AC35-AA35)/(AB35-Z35)","v":-0.2485608573216545},{"$f":"(AC35*Z35-AA35*AB35)/(Z35-AB35)","v":49.727917388351131}]
[null,null,{"$f":"C33+1","v":11},{"$f":"Panels!D70","v":54.985124555160141},{"$f":"Panels!E70","v":18.532965009208102},null,{"$f":"IF(Design!$J$18=\"x\",D36,0)","v":54.985124555160141},{"$f":"IF(Design!$J$18=\"x\",E36,0)","v":18.532965009208102},null,null,{"$f":"K35","v":56.026302060538342},{"$f":"L35","v":27.038070375734513},null,{"$f":"N35","v":6.4368405623811036},86.785285964478803,1310.5347260259464,655.26736301297319,-655.26736301297319,4.231987533330539E-3,655.26524701920653,-655.26524701920653,{"$f":"IF(C36>0,L36,\"\")","v":27.038070375734513},null,null,"Sample Point",{"$f":"Panels!D70","v":54.985124555160141},{"$f":"Panels!E70","v":18.532965009208102},{"$f":"Z36+10*Panels!Q30","v":56.200232945431885},{"$f":"AA36+10*Panels!P30","v":28.458866056462764},{"$f":"(AC36-AA36)/(AB36-Z36)","v":8.168737148654575},{"$f":"(AC36*Z36-AA36*AB36)/(Z36-AB36)","v":-430.62606456792747},{"$f":"(AE35-AE36)/(AD36-AD35)","v":57.06747956591655},{"$f":"AF36*AD36+AE36","v":35.543175742260928}]
[null,null,null,null,null,null,null,null,null,null,{"$f":"K36","v":56.026302060538342},{"$f":"L36","v":27.038070375734513},null,{"$f":"((I35-I32)^2+(J35-J32)^2)^0.5","v":25.249271150932486},{"$f":"O34+N37","v":112.03455711541129},{"$f":"(((D35-D36)^2+(E35-E36)^2)^0.5)*Design!$D$20","v":963.11039032771271},481.55519516385635,-481.55519516385635,-5.6353087529714685E-8,481.5551951920329,-481.5551951920329,{"$f":"IF(C36>0,L37,\"\")","v":27.038070375734513}]
[null,null,null,{"$f":"(D35+AF39)/2","v":63.143739782958278},{"$f":"(E35+AG39)/2","v":34.032855293403571},null,{"$f":"IF(Design!$J$18=\"x\",D38,0)","v":63.143739782958278},{"$f":"IF(Design!$J$18=\"x\",E38,0)","v":34.032855293403571},{"$f":"SUM(D38:D39)/2","v":59.064432169059209},{"$f":"SUM(E38:E39)/2","v":26.282910151305835},{"$f":"IF(Design!$J$17=\"x\",I38,0)","v":59.064432169059209},{"$f":"IF(Design!$J$17=\"x\",J38,0)","v":26.282910151305835},null,{"$f":"N37","v":25.249271150932486},112.03455711541129,963.11039032771271,481.55519516385635,-481.55519516385635,-5.6353087529714685E-8,481.5551951920329,-481.5551951920329,{"$f":"IF(C39>0,L38,\"\")","v":26.282910151305835},null,null,"Panel E (bottom)",{"$f":"Panels!D64","v":32.380888479660726},{"$f":"Panels!E64","v":41.67929598700978},{"$f":"Panels!D65","v":68.761680265546005},{"$f":"Panels!E65","v":32.63645519066953},{"$f":"(AC38-AA38)/(AB38-Z38)","v":-0.2485608573216545},{"$f":"(AC38*Z38-AA38*AB38)/(Z38-AB38)","v":49.727917388351131}]
[null,null,{"$f":"C36+1","v":12},{"$f":"D36","v":54.985124555160141},{"$f":"E36","v":18.532965009208102},null,{"$f":"IF(Design!$J$18=\"x\",D39,0)","v":54.985124555160141},{"$f":"IF(Design!$J$18=\"x\",E39,0)","v":18.532965009208102},null,null,{"$f":"K38","v":59.064432169059209},{"$f":"L38","v":26.282910151305835},null,{"$f":"N38","v":25.249271150932486},112.03455711541129,963.11039032771271,481.55519516385635,-481.55519516385635,-5.6353087529714685E-8,481.5551951920329,-481.5551951920329,{"$f":"IF(C39>0,L39,\"\")","v":26.282910151305835},null,null,"Sample Point",{"$f":"Panels!D57","v":69.22},{"$f":"Panels!E57","v":1.9},{"$f":"Panels!D58","v":69.22},{"$f":"Panels!E58","v":79.38},{"$f":"IF(Z39<>AB39,(AC39-AA39)/(AB39-Z39),\"\")","v":""},{"$f":"IF(Z39<>AB39,(AC39*Z39-AA39*AB39)/(Z39-AB39),\"\")","v":""},{"$f":"IF(AD39<>\"\",(AE38-AE39)/(AD39-AD38),Z39)","v":69.22},{"$f":"AF39*AD38+AE38","v":32.522534844546207}]
[null,null,null,null,null,null,null,null,null,null,{"$f":"K39","v":59.064432169059209},{"$f":"L39","v":26.282910151305835},null,{"$f":"((I38-I35)^2+(J38-J35)^2)^0.5","v":3.1305752699560174},{"$f":"O37+N40","v":115.1651323853673},{"$f":"(((D38-D39)^2+(E38-E39)^2)^0.5)*Design!$D$20","v":984.3981496301617},492.19907481508085,-492.19907481508085,64.363251535927247,460.01744904711722,-460.01744904711722,{"$f":"IF(C39>0,L40,\"\")","v":26.282910151305835}]
[null,null,null,{"$f":"(Panels!D57+AF39)/2","v":69.22},{"$f":"(Panels!E70+AG39)/2","v":25.527749926877156},null,{"$f":"IF(Design!$J$18=\"x\",D41,0)","v":69.22},{"$f":"IF(Design!$J$18=\"x\",E41,0)","v":25.527749926877156},{"$f":"SUM(D41:D42)/2","v":62.10256227758007},{"$f":"SUM(E41:E42)/2","v":22.030357468042631},{"$f":"IF(Design!$J$17=\"x\",I41,0)","v":62.10256227758007},{"$f":"IF(Design!$J$17=\"x\",J41,0)","v":22.030357468042631},null,{"$f":"N40","v":3.1305752699560174},115.1651323853673,984.3981496301617,492.19907481508085,-492.19907481508085,64.363251535927247,460.01744904711722,-460.01744904711722,{"$f":"IF(C42>0,L41,\"\")","v":22.030357468042631}]
[null,null,{"$f":"C39+1","v":13},{"$f":"D39","v":54.985124555160141},{"$f":"E39","v":18.532965009208102},null,{"$f":"IF(Design!$J$18=\"x\",D42,0)","v":54.985124555160141},{"$f":"IF(Design!$J$18=\"x\",E42,0)","v":18.532965009208102},null,null,{"$f":"K41","v":62.10256227758007},{"$f":"L41","v":22.030357468042631},null,{"$f":"N41","v":3.1305752699560174},115.1651323853673,984.3981496301617,492.19907481508085,-492.19907481508085,64.363251535927247,460.01744904711722,-460.01744904711722,{"$f":"IF(C42>0,L42,\"\")","v":22.030357468042631}]
[null,null,null,null,null,null,null,null,null,null,{"$f":"K42","v":62.10256227758007},{"$f":"L42","v":22.030357468042631},null,{"$f":"((I41-I38)^2+(J41-J38)^2)^0.5","v":5.2263217352388525},{"$f":"O40+N43","v":120.39145412060616},{"$f":"(((D41-D42)^2+(E41-E42)^2)^0.5)*Design!$D$20","v":891.36583093331228},445.68291546665614,-445.68291546665614,43.24307747619514,424.06137672855857,-424.06137672855857,{"$f":"IF(C42>0,L43,\"\")","v":22.030357468042631}]
[null,null,null,{"$f":"D41","v":69.22},{"$f":"E42","v":18.532965009208102},null,{"$f":"IF(Design!$J$18=\"x\",D44,0)","v":69.22},{"$f":"IF(Design!$J$18=\"x\",E44,0)","v":18.532965009208102},{"$f":"SUM(D44:D45)/2","v":62.10256227758007},{"$f":"SUM(E44:E45)/2","v":18.532965009208102},{"$f":"IF(Design!$J$17=\"x\",I44,0)","v":62.10256227758007},{"$f":"IF(Design!$J$17=\"x\",J44,0)","v":18.532965009208102},null,{"$f":"N43","v":5.2263217352388525},120.39145412060616,891.36583093331228,445.68291546665614,-445.68291546665614,43.24307747619514,424.06137672855857,-424.06137672855857,{"$f":"IF(C45>0,L44,\"\")","v":18.532965009208102}]
[null,"S3",{"$f":"C42+1","v":14},{"$f":"D42","v":54.985124555160141},{"$f":"E42","v":18.532965009208102},null,{"$f":"IF(Design!$J$18=\"x\",D45,0)","v":54.985124555160141},{"$f":"IF(Design!$J$18=\"x\",E45,0)","v":18.532965009208102},null,null,{"$f":"K44","v":62.10256227758007},{"$f":"L44","v":18.532965009208102},null,{"$f":"N44","v":5.2263217352388525},120.39145412060616,891.36583093331228,445.68291546665614,-445.68291546665614,43.24307747619514,424.06137672855857,-424.06137672855857,{"$f":"IF(C45>0,L45,\"\")","v":18.532965009208102}]
[null,null,null,null,null,null,null,null,null,null,{"$f":"K45","v":62.10256227758007},{"$f":"L45","v":18.532965009208102},null,{"$f":"((I44-I41)^2+(J44-J41)^2)^0.5","v":3.4973924588345291},{"$f":"O43+N46","v":123.88884657944068},{"$f":"(((D44-D45)^2+(E44-E45)^2)^0.5)*Design!$D$20-M46","v":800.00000000000011},400.00000000000006,-400.00000000000006,1.1368683772161603E-13,400,-400,{"$f":"IF(C45>0,L46,\"\")","v":18.532965009208102}]
[null,null,null,{"$f":"D44","v":69.22},{"$f":"Panels!E68","v":16.632965009208103},null,{"$f":"IF(Design!$J$18=\"x\",D47,0)","v":69.22},{"$f":"IF(Design!$J$18=\"x\",E47,0)","v":16.632965009208103},{"$f":"SUM(D47:D48)/2","v":62.10256227758007},{"$f":"SUM(E47:E48)/2","v":16.632965009208103},{"$f":"IF(Design!$J$17=\"x\",I47,0)","v":62.10256227758007},{"$f":"IF(Design!$J$17=\"x\",J47,0)","v":16.632965009208103},null,{"$f":"N46","v":3.4973924588345291},123.88884657944068,800.00000000000011,400.00000000000006,-400.00000000000006,0,{"$f":"$P$46/2","v":400.00000000000006},{"$f":"-T47","v":-400.00000000000006},{"$f":"IF(C48>0,L47,\"\")","v":16.632965009208103}]
[null,null,{"$f":"C45+1","v":15},{"$f":"D45","v":54.985124555160141},{"$f":"E47","v":16.632965009208103},null,{"$f":"IF(Design!$J$18=\"x\",D48,0)","v":54.985124555160141},{"$f":"IF(Design!$J$18=\"x\",E48,0)","v":16.632965009208103},null,null,{"$f":"K47","v":62.10256227758007},{"$f":"L47","v":16.632965009208103},null,{"$f":"N47","v":3.4973924588345291},123.88884657944068,800.00000000000011,400.00000000000006,-400.00000000000006,0,{"$f":"$P$46/2","v":400.00000000000006},-400.00000000000006,{"$f":"IF(C48>0,L48,\"\")","v":16.632965009208103}]
[null,null,null,null,null,null,null,null,null,null,{"$f":"K48","v":62.10256227758007},{"$f":"L48","v":16.632965009208103},null,{"$f":"((I47-I44)^2+(J47-J44)^2)^0.5","v":1.8999999999999986},{"$f":"O46+N49","v":125.78884657944067},{"$f":"(((D47-D48)^2+(E47-E48)^2)^0.5)*Design!$D$20-M49","v":800.00000000000011},400.00000000000006,-400.00000000000006,0,400.00000000000006,-400.00000000000006,{"$f":"IF(C48>0,L49,\"\")","v":16.632965009208103}]
[null,null,null,{"$f":"D41","v":69.22},{"$f":"(E48+E53)/2","v":9.2664825046040509},null,{"$f":"IF(Design!$J$18=\"x\",D50,0)","v":69.22},{"$f":"IF(Design!$J$18=\"x\",E50,0)","v":9.2664825046040509},{"$f":"SUM(D50:D51)/2","v":62.10256227758007},{"$f":"SUM(E50:E51)/2","v":12.949723756906078},{"$f":"IF(Design!$J$17=\"x\",I50,0)","v":62.10256227758007},{"$f":"IF(Design!$J$17=\"x\",J50,0)","v":12.949723756906078},null,{"$f":"N49","v":1.8999999999999986},125.78884657944067,800.00000000000011,400.00000000000006,-400.00000000000006,0,400.00000000000006,-400.00000000000006,{"$f":"IF(C51>0,L50,\"\")","v":12.949723756906078}]
[null,null,{"$f":"C48+1","v":16},{"$f":"D42","v":54.985124555160141},{"$f":"E48","v":16.632965009208103},null,{"$f":"IF(Design!$J$18=\"x\",D51,0)","v":54.985124555160141},{"$f":"IF(Design!$J$18=\"x\",E51,0)","v":16.632965009208103},null,null,{"$f":"K50","v":62.10256227758007},{"$f":"L50","v":12.949723756906078},null,{"$f":"N50","v":1.8999999999999986},125.78884657944067,800.00000000000011,400.00000000000006,-400.00000000000006,0,400.00000000000006,-400.00000000000006,{"$f":"IF(C51>0,L51,\"\")","v":12.949723756906078}]
[null,null,null,null,null,null,null,null,null,null,{"$f":"K51","v":62.10256227758007},{"$f":"L51","v":12.949723756906078},{"$f":"Panels!L125*Panels!L126","v":27.992633517495481},{"$f":"((I50-I47)^2+(J50-J47)^2)^0.5","v":3.6832412523020253},{"$f":"O49+N52","v":129.4720878317427},{"$f":"(((D50-D51)^2+(E50-E51)^2)^0.5)*Design!$D$20-M52","v":872.78089533968034},436.39044766984017,-436.39044766984017,72.780895339680228,400.00000000000006,-400.00000000000006,{"$f":"IF(C51>0,L52,\"\")","v":12.949723756906078}]
[null,null,null,{"$f":"(D54+Panels!D57)/2","v":62.10256227758007},{"$f":"Panels!E57","v":1.9},null,{"$f":"IF(Design!$J$18=\"x\",D53,0)","v":62.10256227758007},{"$f":"IF(Design!$J$18=\"x\",E53,0)","v":1.9},{"$f":"SUM(D53:D54)/2","v":58.543843416370109},{"$f":"SUM(E53:E54)/2","v":9.2664825046040509},{"$f":"IF(Design!$J$17=\"x\",I53,0)","v":58.543843416370109},{"$f":"IF(Design!$J$17=\"x\",J53,0)","v":9.2664825046040509},null,{"$f":"N52","v":3.6832412523020253},129.4720878317427,872.78089533968034,436.39044766984017,-436.39044766984017,72.780895339680228,400.00000000000006,-400.00000000000006,{"$f":"IF(C54>0,L53,\"\")","v":9.2664825046040509}]
[null,null,{"$f":"C51+1","v":17},{"$f":"D51","v":54.985124555160141},{"$f":"E51","v":16.632965009208103},null,{"$f":"IF(Design!$J$18=\"x\",D54,0)","v":54.985124555160141},{"$f":"IF(Design!$J$18=\"x\",E54,0)","v":16.632965009208103},null,null,{"$f":"K53","v":58.543843416370109},{"$f":"L53","v":9.2664825046040509},null,{"$f":"N53","v":3.6832412523020253},129.4720878317427,872.78089533968034,436.39044766984017,-436.39044766984017,72.780895339680228,400.00000000000006,-400.00000000000006,{"$f":"IF(C54>0,L54,\"\")","v":9.2664825046040509}]
[null,null,null,null,null,null,null,null,null,null,{"$f":"K54","v":58.543843416370109},{"$f":"L54","v":9.2664825046040509},{"$f":"M52","v":27.992633517495481},{"$f":"((I53-I50)^2+(J53-J50)^2)^0.5","v":5.1215960457450098},{"$f":"O52+N55","v":134.59368387748771},{"$f":"(((D53-D54)^2+(E53-E54)^2)^0.5)*Design!$D$20-M55","v":891.55714825575774},445.77857412787887,-445.77857412787887,91.557148255757625,400.00000000000006,-400.00000000000006,{"$f":"IF(C54>0,L55,\"\")","v":9.2664825046040509}]
[null,null,null,{"$f":"D57","v":54.985124555160141},{"$f":"Panels!E60","v":1.9},null,{"$f":"IF(Design!$J$18=\"x\",D56,0)","v":54.985124555160141},{"$f":"IF(Design!$J$18=\"x\",E56,0)","v":1.9},{"$f":"SUM(D56:D57)/2","v":54.985124555160141},{"$f":"SUM(E56:E57)/2","v":9.2664825046040509},{"$f":"IF(Design!$J$17=\"x\",I56,0)","v":54.985124555160141},{"$f":"IF(Design!$J$17=\"x\",J56,0)","v":9.2664825046040509},null,{"$f":"N55","v":5.1215960457450098},134.59368387748771,891.55714825575774,445.77857412787887,-445.77857412787887,91.557148255757625,400.00000000000006,-400.00000000000006,{"$f":"IF(C57>0,L56,\"\")","v":9.2664825046040509}]
[null,null,{"$f":"C54+1","v":18},{"$f":"D54","v":54.985124555160141},{"$f":"E54","v":16.632965009208103},null,{"$f":"IF(Design!$J$18=\"x\",D57,0)","v":54.985124555160141},{"$f":"IF(Design!$J$18=\"x\",E57,0)","v":16.632965009208103},null,null,{"$f":"K56","v":54.985124555160141},{"$f":"L56","v":9.2664825046040509},null,{"$f":"N56","v":5.1215960457450098},134.59368387748771,891.55714825575774,445.77857412787887,-445.77857412787887,91.557148255757625,400.00000000000006,-400.00000000000006,{"$f":"IF(C57>0,L57,\"\")","v":9.2664825046040509}]
[null,null,null,null,null,null,null,null,null,null,{"$f":"K57","v":54.985124555160141},{"$f":"L57","v":9.2664825046040509},{"$f":"M55","v":27.992633517495481},{"$f":"((I56-I53)^2+(J56-J53)^2)^0.5","v":3.5587188612099681},{"$f":"O55+N58","v":138.15240273869767},{"$f":"(((D56-D57)^2+(E56-E57)^2)^0.5)*Design!$D$20-M58","v":799.99999999999989},399.99999999999994,-399.99999999999994,-2.2737367544323206E-13,400.00000000000006,-400.00000000000006,{"$f":"IF(C57>0,L58,\"\")","v":9.2664825046040509}]
[null,null,null,{"$f":"D60","v":0},{"$f":"E57","v":16.632965009208103},null,{"$f":"IF(Design!$J$18=\"x\",D59,0)","v":0},{"$f":"IF(Design!$J$18=\"x\",E59,0)","v":16.632965009208103},{"$f":"SUM(D59:D60)/2","v":0},{"$f":"SUM(E59:E60)/2","v":9.2664825046040509},{"$f":"IF(Design!$J$17=\"x\",I59,0)","v":0},{"$f":"IF(Design!$J$17=\"x\",J59,0)","v":9.2664825046040509},null,{"$f":"N58","v":3.5587188612099681},138.15240273869767,799.99999999999989,399.99999999999994,-399.99999999999994,-2.2737367544323206E-13,400.00000000000006,-400.00000000000006,{"$f":"IF(C60>0,L59,\"\")","v":9.2664825046040509},null,null,null,null,"l",{"$f":"((E33-E36)-(D36-D33)*Panels!Q30)/Panels!P30","v":20.551959151700018},"("]
[null,"S4",{"$f":"C57+1","v":19},{"$f":"Panels!D54","v":0},{"$f":"Panels!E54","v":1.9},null,{"$f":"IF(Design!$J$18=\"x\",D60,0)","v":0},{"$f":"IF(Design!$J$18=\"x\",E60,0)","v":1.9},null,null,{"$f":"K59","v":0},{"$f":"L59","v":9.2664825046040509},null,{"$f":"N59","v":3.5587188612099681},138.15240273869767,799.99999999999989,399.99999999999994,-399.99999999999994,-2.2737367544323206E-13,400.00000000000006,-400.00000000000006,{"$f":"IF(C60>0,L60,\"\")","v":9.2664825046040509}]
[null,null,null,null,null,null,null,null,null,null,{"$f":"K60","v":0},{"$f":"L60","v":9.2664825046040509},{"$f":"M58","v":27.992633517495481},{"$f":"((I59-I56)^2+(J59-J56)^2)^0.5","v":54.985124555160141},{"$f":"O58+N61","v":193.13752729385783},{"$f":"(((D59-D60)^2+(E59-E60)^2)^0.5)*Design!$D$20-M61","v":799.99999999999989},399.99999999999994,-399.99999999999994,-2.2737367544323206E-13,400.00000000000006,-400.00000000000006,{"$f":"IF(C60>0,L61,\"\")","v":9.2664825046040509}]
[]
[]
[]
[null,"S2 (Calc)",null,null,null,null,null,null,null,null,null,null,null,null,{"$f":"O25-Driver_Offset","v":58.435166672263748},{"$f":"(($P$46-$P$7)*O65/$O$46+$P$7)","v":1700.6172978727873}]
[]
[]
[null,null,null,"a1",{"$f":"P10","v":2467.127314539347},{"$f":"O10","v":2.7278971549091211}]
[null,null,null,"a2",{"$f":"Design!D25","v":800},{"$f":"O46","v":123.88884657944068}]
[null,null,null,"a3",{"$f":"P46","v":800.00000000000011},{"$f":"O46","v":123.88884657944068}]

{"sheet":"Guides","index":6,"n_rows":28,"n_cols":18,"rows_kept":28,"cut":false,"hidden":false,"merged":[]}
["Guides",null,"x","y",null,"x","y",null,null,"x1","y1","x2","y2","a","b","x","y","l"]
[]
[null,null,{"$f":"Panels!D68","v":0},{"$f":"Panels!E68","v":16.632965009208103},null,{"$f":"IF(Design!$J$19=\"x\",C3,0)","v":0},{"$f":"IF(Design!$J$19=\"x\",D3,0)","v":16.632965009208103}]
[null,1,{"$f":"Panels!D56","v":71.12},{"$f":"D3","v":16.632965009208103},null,{"$f":"IF(Design!$J$19=\"x\",C4,0)","v":71.12},{"$f":"IF(Design!$J$19=\"x\",D4,0)","v":16.632965009208103}]
[]
[null,null,{"$f":"Panels!D40","v":3.8},{"$f":"Panels!E47","v":81.28},null,{"$f":"IF(Design!$J$19=\"x\",C6,0)","v":3.8},{"$f":"IF(Design!$J$19=\"x\",D6,0)","v":81.28}]
[null,2,{"$f":"C6","v":3.8},{"$f":"Panels!E52","v":0},null,{"$f":"IF(Design!$J$19=\"x\",C7,0)","v":3.8},{"$f":"IF(Design!$J$19=\"x\",D7,0)","v":0}]
[]
[null,null,{"$f":"P10","v":71.12},{"$f":"Q10","v":32.050269215635062},null,{"$f":"IF(Design!$J$19=\"x\",C9,0)","v":71.12},{"$f":"IF(Design!$J$19=\"x\",D9,0)","v":32.050269215635062},null,{"$f":"Panels!B62","v":"Panel E"},{"$f":"Panels!D64","v":32.380888479660726},{"$f":"Panels!E64","v":41.67929598700978},{"$f":"Panels!D65","v":68.761680265546005},{"$f":"Panels!E65","v":32.63645519066953},{"$f":"(M9-K9)/(L9-J9)","v":-0.2485608573216545},{"$f":"(M9*J9-K9*L9)/(J9-L9)","v":49.727917388351131}]
[null,3,{"$f":"P11","v":0},{"$f":"Q11","v":49.727917388351131},null,{"$f":"IF(Design!$J$19=\"x\",C10,0)","v":0},{"$f":"IF(Design!$J$19=\"x\",D10,0)","v":49.727917388351131},null,{"$f":"Panels!B74","v":"Panel G"},{"$f":"Panels!D75","v":71.12},{"$f":"Panels!E75","v":0},{"$f":"Panels!D76","v":71.12},{"$f":"Panels!E76","v":81.28},{"$f":"IF(J10<>L10,(M10-K10)/(L10-J10),\"\")","v":""},{"$f":"IF(J10<>L10,(M10*J10-K10*L10)/(J10-L10),\"\")","v":""},{"$f":"IF(N10<>\"\",(O9-O10)/(N10-N9),J10)","v":71.12},{"$f":"P10*N9+O9","v":32.050269215635062},{"$f":"(P10^2+Q10^2)^0.5","v":78.008167244171844}]
[null,null,null,null,null,null,null,null,{"$f":"Panels!B74","v":"Panel G"},{"$f":"Panels!D74","v":0},{"$f":"Panels!E74","v":0},{"$f":"Panels!D77","v":0},{"$f":"Panels!E77","v":81.28},{"$f":"IF(J11<>L11,(M11-K11)/(L11-J11),\"\")","v":""},{"$f":"IF(J11<>L11,(M11*J11-K11*L11)/(J11-L11),\"\")","v":""},{"$f":"IF(N11<>\"\",(O9-O11)/(N11-N9),J11)","v":0},{"$f":"P11*N9+O9","v":49.727917388351131},{"$f":"(P11^2+Q11^2)^0.5","v":49.727917388351131}]
[null,null,null,null,null,{"$f":"IF(Design!$J$19=\"x\",C12,0)","v":0},{"$f":"IF(Design!$J$19=\"x\",D12,0)","v":0}]
[null,4,null,null,null,{"$f":"IF(Design!$J$19=\"x\",C13,0)","v":0},{"$f":"IF(Design!$J$19=\"x\",D13,0)","v":0}]
[]
[null,null,null,null,null,{"$f":"IF(Design!$J$19=\"x\",C15,0)","v":0},{"$f":"IF(Design!$J$19=\"x\",D15,0)","v":0}]
[null,5,null,null,null,{"$f":"IF(Design!$J$19=\"x\",C16,0)","v":0},{"$f":"IF(Design!$J$19=\"x\",D16,0)","v":0}]
[]
[null,null,null,null,null,{"$f":"IF(Design!$J$19=\"x\",C18,0)","v":0},{"$f":"IF(Design!$J$19=\"x\",D18,0)","v":0}]
[null,6,null,null,null,{"$f":"IF(Design!$J$19=\"x\",C19,0)","v":0},{"$f":"IF(Design!$J$19=\"x\",D19,0)","v":0}]
[]
[]
[]
[]
[null,null,0,{"$f":"0","v":0},null,{"$f":"IF(Design!$J$19=\"x\",C24,0)","v":0},{"$f":"IF(Design!$J$19=\"x\",D24,0)","v":0}]
[null,"X",0,{"$f":"MAX(C3:D20)","v":81.28},null,{"$f":"IF(Design!$J$19=\"x\",C25,0)","v":0},{"$f":"IF(Design!$J$19=\"x\",D25,0)","v":81.28}]
[]
[null,null,0,{"$f":"0","v":0},null,{"$f":"IF(Design!$J$19=\"x\",C27,0)","v":0},{"$f":"IF(Design!$J$19=\"x\",D27,0)","v":0}]
[null,"Y",{"$f":"D25","v":81.28},{"$f":"D27","v":0},null,{"$f":"IF(Design!$J$19=\"x\",C28,0)","v":81.28},{"$f":"IF(Design!$J$19=\"x\",D28,0)","v":0}]